{"text_format":"3","workbook":"xlsx","n_sheets":7,"sheets":["COMECE AQUI - LEIA ATENTAMENTE ","INSTRUÇÕES DE USO","DIMENSIONAMENTO","PRODUCT DATA","CALC.","RESULTADO","Versions Log"],"not_rendered":{"images":11},"read":"whole","date_system":"1900"}

{"sheet":"COMECE AQUI - LEIA ATENTAMENTE ","index":0,"n_rows":6,"n_cols":13,"rows_kept":6,"merged":[[0,1,2,21],[4,1,4,10],[4,12,4,21],[5,1,18,10],[5,12,18,21]]}
[null,"CALCULADORA BACKUP FOX ESS"]
[]
[]
[]
[null,"TERMOS DE USO E RECOMENDAÇÕES",{"$nulls":10},"OS CÁLCULOS DESTE ARQUIVO NÃO CONSIDERAM:"]
[null,"A Calculadora de Backup da Fox ESS foi desenvolvida para auxiliar, de forma educativa, no pré-dimensionamento de soluções de backup de energia. Ressaltamos que os resultados gerados são apenas estimativas e não substituem um projeto técnico profissional. A Fox ESS não se responsabiliza por eventuais inadequações decorrentes do uso desta ferramenta. Para garantir que o sistema atenda plenamente às suas demandas, é indispensável a análise de um engenheiro ou especialista qualificado. Ter um sistema híbrido bem dimensionado é essencial para manter a continuidade de energia em aplicações residenciais, comerciais e industriais.\nA autonomia máxima considerada nesta ferramenta é de 24h.",{"$nulls":10},"- Alimentação das cargas por outras fontes (Ex. Fotovoltaico/Solar, Gerador Diesel, Etc);\n   \n- Coeficiente de simultaniedade das cargas (A planilha considera tudo ligado ao mesmo tempo);\n   \n- Tempo necessário e Corrente Recomendada para recarga das baterias."]

{"sheet":"INSTRUÇÕES DE USO","index":1,"n_rows":6,"n_cols":2,"rows_kept":6,"merged":[[0,1,2,10],[4,1,4,10],[5,1,18,10]]}
[null,"CALCULADORA BACKUP FOX ESS"]
[]
[]
[]
[null,"INSTRUÇÕES"]
[null,"Para o uso desta planilha, é extremamente importante que seja feito um levantamento prévio das cargas que serão alimentadas pelo sistema.\n\n1 - A planilha é previamente preenchida com dados de exemplo que devem ser alterados de acordo com os dados do cliente.\n2 - Na aba de Dimensionamento, selecione dentre as opções disponíveis, o tempo de autonomia desejado pelo cliente\n3 - Selecione o Tipo de Rede do cliente dentre as opções disponíveis.\n4 - Preencha a Lista de Equipamentos  nos campos editáveis (em roxo), de acordo com o levantamento feito. Ajuste os nomes dos aparelhos, potências, quantidades, o tempo de uso, o Fator de Potênica (FP -  cargas 100% reativas como Notebook e Roteador tem FP = 1) e a Corrente de Pico (Ip/In) conforme necessário.\nNOTA1: As células que ficarem amarelas e/ou vermelhas, servem como um mero indicativo de potência mais alta (acima de 1kW) ou consumo alto (acima de 5 kWh).\n5 - Após todas as informações preenchidas, a planilha apresenta na aba RESULTADO, o modelo de inversor e a quantidade sugerida, assim como a quantidade de baterias recomendadas no total. Agora é só conferir o kit com o distribuidor de sua preferência e ser feliz com a Fox ESS!\n\nNOTA2: Por padrão, a planilha considera DoD (Profundidade de Descarga) das baterias de 90%, e eficiência de 95%. A eficiência dos inversores varia conforme modelo.\n\nNOTA3: A calculadora considera o balanceamento das baterias por inversor (todos inversores devem ter a mesma quantidade de baterias entre si).\n\nLEMBRE-SE: Essa calculadora foi desenvolvida para auxiliar no pré-dimensionamento de soluções de backup de energia e ressaltamos que os resultados gerados são apenas estimativas e não substituem um projeto técnico profissional. Para garantir que o sistema atenda plenamente às suas demandas, é indispensável a análise de um engenheiro ou especialista qualificado. A Fox-ESS não se responsabiliza por eventuais inadequações decorrentes do uso desta ferramenta.\n"]

{"sheet":"DIMENSIONAMENTO","index":2,"n_rows":27,"n_cols":11,"rows_kept":27,"merged":[[0,1,3,11]]}
[null,"CALCULADORA BACKUP FOX ESS"]
[]
[]
[]
[null,null,"Campos Editáveis"]
[null,"Autonomia  ( Horas)",2]
[null,"Tipo de rede do Cliente:","Bifásica (127/220 V)"]
[null,"Aparelho","Potência Nominal [W]","Tensão Nominal [V]","Quantidade","Tempo Ligado [h]","FP","Ip/In","Potência Total [W]","Potência de Pico [kW]","Consumo diário [Wh]"]
[1,"Laptop",100,220,2,24,{"v":1,"d":"1.0"},{"v":1,"d":"1.0"},{"$f":"IFERROR(IF(Equipmentos[[#This Row],[Quantidade]]=\"\",\"\",Equipmentos[[#This Row],[Potência Nominal '[W']]]*Equipmentos[[#This Row],[Quantidade]]/IF(Equipmentos[[#This Row],[Potência Nominal '[W']]]=\"\",1,Equipmentos[[#This Row],[FP]])),\"\")","v":200},{"$f":"IF(Equipmentos[[#This Row],[Potência Nominal '[W']]]=\"\",0,Equipmentos[[#This Row],[Potência Total '[W']]]*Equipmentos[[#This Row],[Ip/In]])","v":200},{"$f":"IFERROR(IF(Equipmentos[[#This Row],[Quantidade]]=\"\",\"\",Equipmentos[[#This Row],[Potência Total '[W']]]*Equipmentos[[#This Row],[Tempo Ligado '[h']]]),\"\")","v":4800}]
[2,"Modem / Wifi / Internet",20,220,1,24,{"v":1,"d":"1.0"},{"v":1,"d":"1.0"},{"$f":"IFERROR(IF(Equipmentos[[#This Row],[Quantidade]]=\"\",\"\",Equipmentos[[#This Row],[Potência Nominal '[W']]]*Equipmentos[[#This Row],[Quantidade]]/IF(Equipmentos[[#This Row],[Potência Nominal '[W']]]=\"\",1,Equipmentos[[#This Row],[FP]])),\"\")","v":20},{"$f":"IF(Equipmentos[[#This Row],[Potência Nominal '[W']]]=\"\",0,Equipmentos[[#This Row],[Potência Total '[W']]]*Equipmentos[[#This Row],[Ip/In]])","v":20},{"$f":"IFERROR(IF(Equipmentos[[#This Row],[Quantidade]]=\"\",\"\",Equipmentos[[#This Row],[Potência Total '[W']]]*Equipmentos[[#This Row],[Tempo Ligado '[h']]]),\"\")","v":480}]
[3,"Impressora",50,220,1,0,{"v":1,"d":"1.0"},{"v":1,"d":"1.0"},{"$f":"IFERROR(IF(Equipmentos[[#This Row],[Quantidade]]=\"\",\"\",Equipmentos[[#This Row],[Potência Nominal '[W']]]*Equipmentos[[#This Row],[Quantidade]]/IF(Equipmentos[[#This Row],[Potência Nominal '[W']]]=\"\",1,Equipmentos[[#This Row],[FP]])),\"\")","v":50},{"$f":"IF(Equipmentos[[#This Row],[Potência Nominal '[W']]]=\"\",0,Equipmentos[[#This Row],[Potência Total '[W']]]*Equipmentos[[#This Row],[Ip/In]])","v":50},{"$f":"IFERROR(IF(Equipmentos[[#This Row],[Quantidade]]=\"\",\"\",Equipmentos[[#This Row],[Potência Total '[W']]]*Equipmentos[[#This Row],[Tempo Ligado '[h']]]),\"\")","v":0}]
[4,"Luzes",15,220,10,6,{"v":1,"d":"1.0"},{"v":1,"d":"1.0"},{"$f":"IFERROR(IF(Equipmentos[[#This Row],[Quantidade]]=\"\",\"\",Equipmentos[[#This Row],[Potência Nominal '[W']]]*Equipmentos[[#This Row],[Quantidade]]/IF(Equipmentos[[#This Row],[Potência Nominal '[W']]]=\"\",1,Equipmentos[[#This Row],[FP]])),\"\")","v":150},{"$f":"IF(Equipmentos[[#This Row],[Potência Nominal '[W']]]=\"\",0,Equipmentos[[#This Row],[Potência Total '[W']]]*Equipmentos[[#This Row],[Ip/In]])","v":150},{"$f":"IFERROR(IF(Equipmentos[[#This Row],[Quantidade]]=\"\",\"\",Equipmentos[[#This Row],[Potência Total '[W']]]*Equipmentos[[#This Row],[Tempo Ligado '[h']]]),\"\")","v":900}]
[5,"TV",68,220,1,4,{"v":1,"d":"1.0"},{"v":1,"d":"1.0"},{"$f":"IFERROR(IF(Equipmentos[[#This Row],[Quantidade]]=\"\",\"\",Equipmentos[[#This Row],[Potência Nominal '[W']]]*Equipmentos[[#This Row],[Quantidade]]/IF(Equipmentos[[#This Row],[Potência Nominal '[W']]]=\"\",1,Equipmentos[[#This Row],[FP]])),\"\")","v":68},{"$f":"IF(Equipmentos[[#This Row],[Potência Nominal '[W']]]=\"\",0,Equipmentos[[#This Row],[Potência Total '[W']]]*Equipmentos[[#This Row],[Ip/In]])","v":68},{"$f":"IFERROR(IF(Equipmentos[[#This Row],[Quantidade]]=\"\",\"\",Equipmentos[[#This Row],[Potência Total '[W']]]*Equipmentos[[#This Row],[Tempo Ligado '[h']]]),\"\")","v":272}]
[6,"MicroOndas",800,220,1,0.3,{"v":1,"d":"1.0"},{"v":1,"d":"1.0"},{"$f":"IFERROR(IF(Equipmentos[[#This Row],[Quantidade]]=\"\",\"\",Equipmentos[[#This Row],[Potência Nominal '[W']]]*Equipmentos[[#This Row],[Quantidade]]/IF(Equipmentos[[#This Row],[Potência Nominal '[W']]]=\"\",1,Equipmentos[[#This Row],[FP]])),\"\")","v":800},{"$f":"IF(Equipmentos[[#This Row],[Potência Nominal '[W']]]=\"\",0,Equipmentos[[#This Row],[Potência Total '[W']]]*Equipmentos[[#This Row],[Ip/In]])","v":800},{"$f":"IFERROR(IF(Equipmentos[[#This Row],[Quantidade]]=\"\",\"\",Equipmentos[[#This Row],[Potência Total '[W']]]*Equipmentos[[#This Row],[Tempo Ligado '[h']]]),\"\")","v":240}]
[7,"Air Fryer",1500,220,0,0,{"v":1,"d":"1.0"},{"v":1,"d":"1.0"},{"$f":"IFERROR(IF(Equipmentos[[#This Row],[Quantidade]]=\"\",\"\",Equipmentos[[#This Row],[Potência Nominal '[W']]]*Equipmentos[[#This Row],[Quantidade]]/IF(Equipmentos[[#This Row],[Potência Nominal '[W']]]=\"\",1,Equipmentos[[#This Row],[FP]])),\"\")","v":0},{"$f":"IF(Equipmentos[[#This Row],[Potência Nominal '[W']]]=\"\",0,Equipmentos[[#This Row],[Potência Total '[W']]]*Equipmentos[[#This Row],[Ip/In]])","v":0},{"$f":"IFERROR(IF(Equipmentos[[#This Row],[Quantidade]]=\"\",\"\",Equipmentos[[#This Row],[Potência Total '[W']]]*Equipmentos[[#This Row],[Tempo Ligado '[h']]]),\"\")","v":0}]
{"$rows_left_out":13}
{"sheet":"PRODUCT DATA","index":3,"n_rows":20,"n_cols":25,"rows_kept":20,"hidden":true}
[{"$nulls":23},384,27]
[null,"Fox ESS name","Max Power EPS [W]","Rated Voltage [V]","Peak Power (60s)  [W]","Picture","Efficiency","Bat Máx Current","Bat Input","Max. Array Power","Recommended PV Power","Max PV Voltage","Min MPPT Voltage","Max MPPT Voltage","Max PV I","PV Isc","MPPTs","Input per MPPT"]
[null,"H1-5.0-E-G2",5000,220,5500,{"$error":"#VALUE!"},{"v":0.97,"d":"97.00%"},50,1,10000,10000,600,80,550,16,20,2,1]
[null,"KH7.5",7500,220,10000,{"$error":"#VALUE!"},{"v":0.972,"d":"97.20%"},50,1,16000,12000,600,80,500,16,20,3,1]
[null,"KH10.5",10500,220,15000,{"$error":"#VALUE!"},{"v":0.972,"d":"97.20%"},50,1,21000,15000,600,80,500,16,20,4,1]
[null,"H1-5.7-US",5700,"127/220",7695,{"$error":"#VALUE!"},{"v":0.97,"d":"97.00%"},50,1,11400,11400,600,80,550,14,28,3,1]
[null,"H1-7.5-US",7500,"127/220",10125,{"$error":"#VALUE!"},{"v":0.97,"d":"97.00%"},50,1,15000,15000,600,80,550,14,28,3,1]
[null,"H1-11.4-US",11400,"127/220",15389,{"$error":"#VALUE!"},{"v":0.97,"d":"97.00%"},50,1,22800,22800,600,80,550,14,28,3,1]
[null,"H3-PRO-11.5",11500,220,12600,{"$error":"#VALUE!"},{"v":0.973,"d":"97.30%"},50,2,22000,16500,1000,150,850,16,20,3,2]
[null,"H3-PRO-20.0",20000,380,24000,{"$error":"#VALUE!"},{"v":0.973,"d":"97.30%"},50,2,40000,30000,1000,150,850,16,20,3,2]
[null,"H3-PRO-17.3",17300,220,19000,{"$error":"#VALUE!"},{"v":0.973,"d":"97.30%"},50,2,34000,25500,1000,150,850,16,20,3,2]
[null,"H3-PRO-30.0",30000,380,36000,{"$error":"#VALUE!"},{"v":0.973,"d":"97.30%"},50,2,60000,45000,1000,150,850,16,20,3,2]
[]
[null,"Fox ESS name","Tech espc.","Nominal Voltage","Column1","Weight","Column2","Picture",null,"Model","Nom. Capacity","Nom. Power","Peak Power","DoD","RT Efficiency","Voltage","Nom. Current","Picture","Recom. Charge Cur."]
[null,"HV Junction-Box","-","-","-","-","-",{"$error":"#VALUE!"},null,"EP5",5.18,{"$f":"K15","v":5.18},{"$f":"Bateries[[#This Row],[Nom. Power]]*2.41","v":12.4838},{"v":0.9,"d":"90%"},{"v":0.95,"d":"95%"},192,27,{"$error":"#VALUE!"},{"$f":"Bateries[[#This Row],[Nom. Current]]/2","v":13.5}]
{"$rows_left_out":6}
{"sheet":"CALC.","index":4,"n_rows":68,"n_cols":20,"rows_kept":68,"hidden":true}
[]
[null,"Warnings:","Reason",{"$nulls":3},"Grid Selected","kW required:"]
[null,"NÃO RECOMENDADO PARA ESTA APLICAÇÃO","Too much Power",{"$nulls":3},{"$f":"DIMENSIONAMENTO!C7","v":"Bifásica (127/220 V)"},{"$f":"DIMENSIONAMENTO!I26*1000","v":{"v":4988,"d":"4988.00"}}]
[null,"NÃO INDICADO PARA OPERAÇÃO EM BACKUP OU OFF-GRID","Too much Power"]
[null,"PARALELISMO PERMITIDO APENAS  COM INCLUSÃO DO FOX HUB (VERIFIQUE COMPATIBILIDADE)","H1-US in Parallel",null,"REF","QTY","Single Phase","Split phase","3x 220","3x 380",null,"kWh required:",{"$f":"IF(DIMENSIONAMENTO!K26=0,\"\",DIMENSIONAMENTO!K26/24*DIMENSIONAMENTO!C6)","v":3.1826666666666665}]
[null,"PARALELISMO PERMITIDO APENAS  COM INCLUSÃO DO  AI LINK","H3-Pro in Parallel",null,1,1,{"$f":"'PRODUCT DATA'!C3*'PRODUCT DATA'!G3","v":4850},{"$f":"'PRODUCT DATA'!$C$6*F6*'PRODUCT DATA'!G6","v":5529},{"$f":"'PRODUCT DATA'!$C$9*F6*'PRODUCT DATA'!G9","v":{"v":11189.5,"d":"11190"}},{"$f":"'PRODUCT DATA'!$C$10*F6*'PRODUCT DATA'!G10","v":19460}]
[null,"PARALELISMO PERMITIDO APENAS  COM INCLUSÃO DO EPS BOX"," H3-E in Parallel",null,2,2,null,null,{"$f":"I6*F7","v":22379},{"$f":"J6*F7","v":38920},null,"Qty","Capacity EP5","Power EP5","Peak Power EP5","Efficiency EP5","Capacity EP11","Power EP11","Peak Power EP11","Efficieny EP11"]
[null,"VERIFIQUE AS TENSÕES NOMINAIS DOS APARELHOS E TIPO DE REDE ","Grid type and Load Voltage incompatible",null,3,3]
[null,"PREENCHA O FATOR DE POTÊNCIA DE TODOS OS APARELHOS","PF not filled",null,4,4,{"$nulls":5},1,{"$f":"'PRODUCT DATA'!$L$15*'PRODUCT DATA'!$N$15*'PRODUCT DATA'!$O$15*N12","v":{"v":4.4289,"d":"4.43"}},{"$f":"ROUNDDOWN(_xlfn.LET(\n    _xlpm.entradas, IF(ISNUMBER(MATCH('CALC.'!$G$68,'PRODUCT DATA'!$B$9:$B$12,0)),2,1),\n    _xlpm.I_banco, 'PRODUCT DATA'!$Q$15*$N$12,\n    _xlpm.I_inversor, VLOOKUP('CALC.'!$G$68,'PRODUCT DATA'!$B$2:$I$12,7,0)*_xlpm.entradas*'CALC.'!$H$68,\n    'PRODUCT DATA'!$P$15*MIN(_xlpm.I_banco,_xlpm.I_inversor)/1000\n),\n2\n)","v":5.18},{"$f":"BatCalc[[#This Row],[Power EP5]]*2.41","v":{"v":12.4838,"d":"12.48"}},{"$f":"'PRODUCT DATA'!$O$15","v":{"v":0.95,"d":"95%"}},{"$f":"'PRODUCT DATA'!$L$16*'PRODUCT DATA'!$N$16*'PRODUCT DATA'!$O$16*R12","v":{"v":8.8578,"d":"8.86"}},{"$f":"ROUNDDOWN(\n_xlfn.LET(\n    _xlpm.entradas, IF(ISNUMBER(MATCH('CALC.'!$G$68,'PRODUCT DATA'!$B$9:$B$12,0)),2,1),\n    _xlpm.corrente_banco, 'PRODUCT DATA'!$Q$16*$R$12,\n    _xlpm.corrente_inversores, VLOOKUP('CALC.'!$G$68,'PRODUCT DATA'!$B$2:$I$12,7,0)*_xlpm.entradas*'CALC.'!$H$68,\n    'PRODUCT DATA'!$P$16*MIN(_xlpm.corrente_banco,_xlpm.corrente_inversores)/1000\n),\n2\n)","v":10.36},{"$f":"BatCalc[[#This Row],[Power EP11]]*2.41","v":{"v":24.9676,"d":"24.97"}},{"$f":"'PRODUCT DATA'!$O$16","v":{"v":0.95,"d":"95%"}}]
[null,"PREENCHA A CORRENTE DE PICO (Ip/In) DE TODOS OS APARELHOS","Peak Current not filled",null,5,1,{"$f":"'PRODUCT DATA'!C4*'PRODUCT DATA'!G4","v":7290},{"$f":"'PRODUCT DATA'!$C$7*F10*'PRODUCT DATA'!G7","v":7275}]
[null,"PREENCHA A TENSÃO NOMINAL DE TODOS OS APARELHOS","Load voltage not filled",null,6,2,{"$f":"G$10*$F11","v":14580},{"$f":"H10*F11","v":14550},{"$nulls":3},"Battery per Inv input",null,{"$f":"IFERROR(ROUNDUP(IF(OR('CALC.'!G68='PRODUCT DATA'!B9,'CALC.'!G68='PRODUCT DATA'!B10,'CALC.'!G68='PRODUCT DATA'!B11,'CALC.'!G68='PRODUCT DATA'!B12),ROUNDUP(N12/'CALC.'!H68,0)*'CALC.'!H68/RESULTADO!C10/2,RESULTADO!C13/RESULTADO!C10),0),\"\")","v":1},{"$nulls":3},{"$f":"ROUNDUP(IF(OR('CALC.'!G68='PRODUCT DATA'!B9,'CALC.'!G68='PRODUCT DATA'!B10,'CALC.'!G68='PRODUCT DATA'!B11,'CALC.'!G68='PRODUCT DATA'!B12),RESULTADO!C15/RESULTADO!C10/2,RESULTADO!C15/RESULTADO!C10),0)","v":1}]
[null,"MÁXIMO DE 4 BATERIAS POR INVERSOR -  UTILIZE EXCLUSIVAMENTE BATERIAS EP11","Too much Authonomy",null,7,3,{"$nulls":5},"Calc over Nom Power:",null,{"$f":"ROUNDUP(\n_xlfn.LET(\n    _xlpm.capacidade, VLOOKUP(\"EP5\",'PRODUCT DATA'!$J$14:$S$19,2,0),\n    _xlpm.dod, VLOOKUP(\"EP5\",'PRODUCT DATA'!$J$14:$S$19,5,0),\n    _xlpm.eficiencia, VLOOKUP(\"EP5\",'PRODUCT DATA'!$J$14:$S$19,6,0),\n    M5/(_xlpm.capacidade*_xlpm.dod*_xlpm.eficiencia)\n)    /'CALC.'!$H$68,0)*'CALC.'!$H$68","v":1},{"$nulls":3},{"$f":"ROUNDUP(\n_xlfn.LET(\n    _xlpm.capacidade, VLOOKUP(\"EP11\",'PRODUCT DATA'!$J$14:$S$19,2,0),\n    _xlpm.dod, VLOOKUP(\"EP11\",'PRODUCT DATA'!$J$14:$S$19,5,0),\n    _xlpm.eficiencia, VLOOKUP(\"EP11\",'PRODUCT DATA'!$J$14:$S$19,6,0),\n    M5/(_xlpm.capacidade*_xlpm.dod*_xlpm.eficiencia)\n)    /'CALC.'!$H$68,0)*'CALC.'!$H$68","v":1}]
[null,"MÁXIMO DE 4 BATERIAS POR INVERSOR - AUMENTE  A QUANTIDADE DE INVERSORES (AUMENTE AS CARGAS EM KW)","Too much Authonomy",null,8,4,{"$nulls":5},"Calc over Peak Power:",null,{"$f":"ROUNDUP(O9/H32,0)","v":1},{"$nulls":3},{"$f":"ROUNDUP(S9/H32,0)","v":1}]
[null,"MÁXIMO DE 8 BATERIAS POR INVERSOR - AUMENTE  A QUANTIDADE DE INVERSORES (AUMENTE AS CARGAS EM KW)","Too much Authonomy",null,9,5,{"$nulls":5},"Final Decision:",null,{"$f":"IF(N13=0,999,MAX(N12:N13))","v":1},{"$nulls":3},{"$f":"IF(R13=0,999,MAX(R12:R13))","v":1}]
[null,"JUNCTION BOX OBRIGATÓRIA APENAS EM CASO DE USO DA BATERIA EP5","Batteries in Parallel",null,10,1,{"$f":"'PRODUCT DATA'!C5*'PRODUCT DATA'!G5","v":10206},{"$f":"'PRODUCT DATA'!C8*'PRODUCT DATA'!G8","v":11058},{"$f":"'PRODUCT DATA'!$C$11*F15*'PRODUCT DATA'!G11","v":{"v":16832.899999999998,"d":"16833"}},{"$f":"'PRODUCT DATA'!$C$12*F15*'PRODUCT DATA'!G12","v":29190}]
{"$rows_left_out":54}
{"sheet":"RESULTADO","index":5,"n_rows":32,"n_cols":13,"rows_kept":32,"merged":[[0,1,3,13],[5,4,5,6],[5,8,10,9],[5,10,6,10],[5,11,17,11],[5,12,8,12],[5,13,8,13],[6,1,6,2],[6,4,6,6],[7,1,8,1],[7,2,8,2],[7,4,8,6],[8,10,10,10],[9,4,10,6],[9,12,13,13],[11,4,11,6],[11,8,12,10],[12,4,13,6],[13,1,13,2],[13,8,13,9],[14,8,17,9],[14,12,17,13]]}
[null,"CALCULADORA BACKUP FOX ESS"]
[]
[]
[]
[]
[{"$nulls":4},"AVISOS:",{"$nulls":3},{"$f":"IF(\n   COUNTA(DIMENSIONAMENTO!B9:H24)=0,\n   \"\",\n   _xlfn.IFNA(VLOOKUP(B10,'PRODUCT DATA'!B2:I12,5,0),\"\")\n)","v":{"$error":"#VALUE!"}},{"$nulls":3},{"$f":"IFERROR(_xlfn.IFS(E8='CALC.'!B5,'PRODUCT DATA'!H18,E8='CALC.'!B6,'PRODUCT DATA'!H16),\"\")","v":""}]
[null,"Lista de Produtos (Total Fox ESS)",null,null,{"$f":"_xlfn.LET(\n\n_xlpm.QtdEquip, SUM(Equipmentos[Quantidade]),\n_xlpm.DimVazio, COUNTA(DIMENSIONAMENTO!B9:H24)=0,\n_xlpm.FaixaInvalida, OR(\n    COUNTIF(DIMENSIONAMENTO!G9:G24,\"<0.8\")>0,\n    COUNTIF(DIMENSIONAMENTO!G9:G24,\">1\")>0\n),\n\n_xlpm.TipoAlta, OR(B10='PRODUCT DATA'!B9,B10='PRODUCT DATA'!B10,B10='PRODUCT DATA'!B11,B10='PRODUCT DATA'!B12),\n_xlpm.TipoMedia, OR(B10='PRODUCT DATA'!B3,B10='PRODUCT DATA'!B4,B10='PRODUCT DATA'!B5,B10='PRODUCT DATA'!B6,B10='PRODUCT DATA'!B7,B10='PRODUCT DATA'!B8),\n\nIF(\nB10=\"\",\"\",\n\nIF(\n_xlpm.QtdEquip=0,\"\",\n\nIF(\n_xlpm.DimVazio,\"\",\n\nIF(\n_xlpm.FaixaInvalida,\n'CALC.'!B23,\n\nIFERROR(\n\n_xlfn.IFS(\n\nAND(_xlpm.TipoAlta,('CALC.'!R12/RESULTADO!C10)>8),\n'CALC.'!B14,\n\nAND(_xlpm.TipoMedia,('CALC.'!R12/RESULTADO!C10)>4),\n'CALC.'!B13,\n\nAND('CALC.'!N11>1,'CALC.'!R11<2),\n'CALC.'!B15,\n\nAND(_xlpm.TipoAlta,C15/C10<3,'CALC.'!N12/C10>2,C13<>\"\"),\n'CALC.'!B15,\n\nAND(_xlpm.TipoAlta,C15<5,C13>5,C13<>\"\"),\n'CALC.'!B19\n\n),\n\n\"\"\n)\n\n)\n)\n)\n)\n)","v":""}]
[null,"Modelo","Quantidade",null,{"$f":"IF(SUM(Equipmentos[Quantidade])=0,'CALC.'!B22,IF(\n   COUNTA(DIMENSIONAMENTO!B9:H24)=0,\n   \"\",\n   _xlfn.IFNA(_xlfn.IFS('CALC.'!H66=0,'CALC.'!B21,C10>10,'CALC.'!B3,C10<2,\"\",C10>4,'CALC.'!B4,B10='PRODUCT DATA'!B6,'CALC.'!B5,B10='PRODUCT DATA'!B7,'CALC.'!B5,B10='PRODUCT DATA'!B8,'CALC.'!B5,B10='PRODUCT DATA'!B9,'CALC.'!B6,B10='PRODUCT DATA'!B11,'CALC.'!B6,B10='PRODUCT DATA'!B10,'CALC.'!B6,B10='PRODUCT DATA'!B12,'CALC.'!B6,B10='PRODUCT DATA'!B3,\"\",B10='PRODUCT DATA'!B4,\"\",B10='PRODUCT DATA'!B5,\"\"),\"\")\n))","v":""},{"$nulls":5},{"$f":"IF(M6=\"\",\"\",\"+\")","v":""}]
[]
[null,{"$f":"IF('CALC.'!H68>4,\"\",IF(SUM(Equipmentos[Quantidade])=0,\"\",IF(\n   COUNTA(DIMENSIONAMENTO!B9:H24)=0,\"\",\n   _xlfn.IFNA('CALC.'!G68,\"\")\n)))","v":"H1-5.7-US"},{"$f":"IF(SUM(Equipmentos[Quantidade])=0,\"\",IF(\n   COUNTA(DIMENSIONAMENTO!B9:H24)=0,\n   \"\",\n   _xlfn.IFNA(IF(B10=\"\",\"\",'CALC.'!H68),\"\")\n))","v":1},null,{"$f":"IF(SUM(Equipmentos[Quantidade])=0,\"\",IF(\n   COUNTA(DIMENSIONAMENTO!B9:H24)=0,\n   \"\",\n   _xlfn.IFNA(_xlfn.IFS(\n   SUMPRODUCT(\n      --(DIMENSIONAMENTO!H8:H24=\"\"),\n      --(MMULT(--(DIMENSIONAMENTO!B8:H24<>\"\"),TRANSPOSE(COLUMN(DIMENSIONAMENTO!B8:H8)^0))>0)\n   )>0, 'CALC.'!B10,\n\n   SUMPRODUCT(\n      --(DIMENSIONAMENTO!D8:D24=\"\"),\n      --(MMULT(--(DIMENSIONAMENTO!B8:H24<>\"\"),TRANSPOSE(COLUMN(DIMENSIONAMENTO!B8:H8)^0))>0)\n   )>0, 'CALC.'!B11,\n\n   SUMPRODUCT(\n      --(DIMENSIONAMENTO!G8:G24=\"\"),\n      --(MMULT(--(DIMENSIONAMENTO!B8:H24<>\"\"),TRANSPOSE(COLUMN(DIMENSIONAMENTO!B8:H8)^0))>0)\n   )>0, 'CALC.'!B9,\n\n   OR(\n      AND(DIMENSIONAMENTO!C7='CALC.'!C43,\n          OR(COUNTIF(Equipmentos[Tensão Nominal '[V']],127)>0,\n             COUNTIF(Equipmentos[Tensão Nominal '[V']],380)>0)\n      ),\n      AND(DIMENSIONAMENTO!C7='CALC.'!C44,\n          COUNTIF(Equipmentos[Tensão Nominal '[V']],380)>0\n      ),\n      AND(DIMENSIONAMENTO!C7='CALC.'!C45,\n          COUNTIF(Equipmentos[Tensão Nominal '[V']],127)>0\n      ),\n      AND(DIMENSIONAMENTO!C7='CALC.'!C46,\n          COUNTIF(Equipmentos[Tensão Nominal '[V']],380)>0\n      )\n   ), 'CALC.'!B8,\n\n   TRUE, \"\"\n),\"\")\n))","v":""}]
[null,{"$f":"IFERROR(IF(OR('CALC.'!N11>1,'CALC.'!R11>1),'PRODUCT DATA'!B15,\"\"),\"\")","v":""},{"$f":"IF(\n    B11<>\"HV Junction-Box\",\n    \"\",\n    IFERROR(\n        IF(\n            OR(\n                AND(N($C$13)>0, N($C$13)/N($C$10)=3),\n                AND(N($C$15)>0, N($C$15)/N($C$10)=3)\n            ),\n            $C$10,\n            _xlfn.LET(\n                _xlpm.inversores, N($C$10),\n                _xlpm.entradas, N(VLOOKUP(B10,Inverters[#All],8,0)),\n                _xlpm.total_bat, N($C$13)+N($C$15),\n                MIN(INT(_xlpm.total_bat/2), _xlpm.entradas*_xlpm.inversores)\n            )\n        ),\n        \"\"\n    )\n)","v":""}]
[null,{"$f":"IF(SUM(Equipmentos[Quantidade])=0,\"\",IFERROR(_xlfn.IFS(E8='CALC.'!B5,'PRODUCT DATA'!B18,E8='CALC.'!B6,'PRODUCT DATA'!B16),\"\"))","v":""},{"$f":"IF(SUM(Equipmentos[Quantidade])=0,\"\",IF(B12=\"\",\"\",\"1.00\"))","v":""},null,"DICAS:",{"$nulls":3},{"$f":"IF(C11=\"\",\"\",'PRODUCT DATA'!H15)","v":""}]
[null,{"$f":"IF(B10=\"\",\"\",IF(SUM(Equipmentos[Quantidade])=0,\"\",IF(\n   COUNTA(DIMENSIONAMENTO!B9:H24)=0,\n   \"\",\n   _xlfn.IFNA(IF('CALC.'!N12/C10<5,'PRODUCT DATA'!J15,\"\"),\"\")\n)))","v":"EP5"},{"$f":"IF(SUM(Equipmentos[Quantidade])=0,\"\",IF(\n   COUNTA(DIMENSIONAMENTO!B9:H24)=0,\n   \"\",\n   _xlfn.IFNA(IF(B13=\"\",\"\",'CALC.'!N14),\"\")\n))","v":1},null,{"$f":"IF(SUM(Equipmentos[Quantidade])=0,\"\",IF(\n   OR(\n      B10=\"ERRO\",\n      'CALC.'!N14>'CALC.'!N12,\n      'CALC.'!R14>'CALC.'!R12,\n      'CALC.'!H68>'CALC.'!H65,\n      'CALC.'!G68<>'CALC.'!G65\n   ),\n   'CALC.'!B18,\n   IF(\n      SUM(Equipmentos[Quantidade])=0,\n      \"\",\n      IF(\n         COUNTA(DIMENSIONAMENTO!B9:H24)=0,\n         \"\",\n         _xlfn.IFNA(\n            _xlfn.IFS(\n               C18>=F22, 'CALC.'!B16,\n               C18>=F18, 'CALC.'!B17\n            ),\n            \"\"\n         )\n      )\n   )\n))","v":""}]
[null,{"$f":"IF(B13<>\"\",\"OU\",\"\")","v":"OU"}]
[null,{"$f":"IF(B10=\"\",\"\",IF(SUM(Equipmentos[Quantidade])=0,\"\",IF(\n   COUNTA(DIMENSIONAMENTO!B9:H24)=0,\n   \"\",\n   _xlfn.IFNA('PRODUCT DATA'!J16,\"\")\n)))","v":"EP11"},{"$f":"IF(B10=\"\",\"\",IF(SUM(Equipmentos[Quantidade])=0,\"\",IF(\nCOUNTA(DIMENSIONAMENTO!B9:H24)=0,\n\"\",\n_xlfn.IFNA('CALC.'!R14,\"\")\n)))","v":1},{"$nulls":5},{"$f":"IF(B13=\"\",\"\",VLOOKUP(B13,'PRODUCT DATA'!J14:R19,9,0))","v":{"$error":"#VALUE!"}},{"$nulls":3},{"$f":"IF(B15=\"\",\"\",VLOOKUP(B15,'PRODUCT DATA'!J14:R19,9,0))","v":{"$error":"#VALUE!"}}]
{"$rows_left_out":18}
{"sheet":"Versions Log","index":6,"n_rows":11,"n_cols":5,"rows_kept":11,"hidden":true}
[]
[]
[null,null,"Version","Date","Upgrades"]
[null,null,2,{"v":45776,"d":"4577600.00%"}]
[null,null,3.1,{"v":45933,"d":"4593300.00%"}]
[null,null,4.2,{"v":45960,"d":"4596000.00%"}]
[null,null,"4.2.1",{"v":45972,"d":"4597200.00%"}]
[null,null,5.1,{"v":46010,"d":"4601000.00%"},"Removed H3-12\nIncluded H3-PRO-30\nIncluded PF calculations\nIncluded Peak Power Calculations\nAdded Battery Discharge Power Calculations\nAdded Hints\nRemoved Result from DIMENSIONAMENTO tab"]
[null,null,"5.2.1",{"v":46013,"d":"4601300.00%"},"Bug fix\nIn case of more then 4x EP5 per inverter, only EP11 will be recommended\nIncluded balance, so all inverter have the same amount of batteries"]
[null,null,"V5.4",{"v":46031,"d":"4603100.00%"},"Improvements on Battery Power Calculations\nImprovements on Battery Qty Calculations\nImprovements on Inverters Qty Calculations\nImprovements on Junction Box Qty Calculations\nIncluded Batteries and Inverters Efficiency"]
[null,null,5.5,null,"Included Logs\nIncluded EP6 and EP12 Data\nIncluded PV data of each inverter\nFixed issue when deleting a line from DIMENSIONAMENTO\nFixed Peak Power calculations\nWhen the DIMENSIONAMENTO tab is blanked or ,quantity is 0 results are blanked\nAdvice when PF is out of range\nIncluded Batteries Peak Power Calc."]