{"text_format":"3","workbook":"xlsx","n_sheets":5,"sheets":["COMECE AQUI - LEIA ATENTAMENTE ","INSTRUÇÕES DE USO","DIMENSIONAMENTO","Dados","RESULTADO"],"not_rendered":{"images":11},"read":"whole","date_system":"1900"}

{"sheet":"COMECE AQUI - LEIA ATENTAMENTE ","index":0,"n_rows":6,"n_cols":13,"rows_kept":6,"merged":[[0,1,2,21],[4,1,4,10],[4,12,4,21],[5,1,18,10],[5,12,18,21]]}
[null,"CALCULADORA BACKUP FOX ESS"]
[]
[]
[]
[null,"TERMOS DE USO E RECOMENDAÇÕES",{"$nulls":10},"OS CÁLCULOS DESTE ARQUIVO NÃO CONSIDERAM:"]
[null,"A Calculadora de Backup da Fox ESS foi desenvolvida para auxiliar, de forma educativa, no pré-dimensionamento de soluções de backup de energia. Ressaltamos que os resultados gerados são apenas estimativas e não substituem um projeto técnico profissional. A Fox ESS não se responsabiliza por eventuais inadequações decorrentes do uso desta ferramenta. Para garantir que o sistema atenda plenamente às suas demandas, é indispensável a análise de um engenheiro ou especialista qualificado. Ter um sistema híbrido bem dimensionado é essencial para manter a continuidade de energia em aplicações residenciais, comerciais e industriais.\nA autonomia máxima considerada nesta ferramenta é de 24h.",{"$nulls":10},"- Alimentação das cargas por outras fontes (Ex. Fotovoltaico/Solar, Gerador Diesel, Etc);\n   \n- Coeficiente de simultaniedade das cargas (A planilha considera tudo ligado ao mesmo tempo);\n   \n- Eficiência de inversores e baterias;\n   \n- Corrente Recomendada e tempo de carregamento das baterias."]

{"sheet":"INSTRUÇÕES DE USO","index":1,"n_rows":6,"n_cols":2,"rows_kept":6,"merged":[[0,1,2,10],[4,1,4,10],[5,1,18,10]]}
[null,"CALCULADORA BACKUP FOX ESS"]
[]
[]
[]
[null,"INSTRUÇÕES"]
[null,"Para o uso desta planilha, é extremamente importante que seja feito um levantamento prévio das cargas que serão alimentadas pelo sistema.\n\n1 - A planilha é previamente preenchida com dados de exemplo que devem ser alterados de acordo com os dados do cliente.\n2 - Na aba de Dimensionamento, selecione dentre as opções disponíveis, o tempo de autonomia desejado pelo cliente\n3 - Selecione o Tipo de Rede do cliente dentre as opções disponíveis.\n4 - Preencha a Lista de Equipamentos  nos campos editáveis (em roxo), de acordo com o levantamento feito. Ajuste os nomes dos aparelhos, potências, quantidades, o tempo de uso, o Fator de Potênica (FP -  cargas 100% reativas como Notebook e Roteador tem FP = 1) e a Corrente de Pico (Ip/In) conforme necessário.\nNOTA1: As células que ficarem amarelas e/ou vermelhas, servem como um mero indicativo de potência mais alta (acima de 1kW) ou consumo alto.\nNOTA2: Por padrão a planilha considera DoD (Profundidade de Descarga) das baterias de 90%, sem perdas.\n5 - Após todas as informações preenchidas, a planilha apresenta na aba RESULTADO, o modelo de inversor e a quantidade sugerida, assim como a quantidade de baterias recomendadas por inversor. Agora é só conferir o kit com o distribuidor de sua preferência e ser feliz com a Fox ESS!\n\nLEMBRE-SE: Essa calculadora foi desenvolvida para auxiliar no pré-dimensionamento de soluções de backup de energia e ressaltamos que os resultados gerados são apenas estimativas e não substituem um projeto técnico profissional. Para garantir que o sistema atenda plenamente às suas demandas, é indispensável a análise de um engenheiro ou especialista qualificado. A Fox-ESS não se responsabiliza por eventuais inadequações decorrentes do uso desta ferramenta.\n"]

{"sheet":"DIMENSIONAMENTO","index":2,"n_rows":27,"n_cols":11,"rows_kept":27,"merged":[[0,1,3,11]]}
[null,"CALCULADORA BACKUP FOX ESS"]
[]
[]
[]
[null,null,"Campos Editáveis"]
[null,"Autonomia  ( Horas)",2]
[null,"Tipo de rede do Cliente:","Bifásica (127/220 V)"]
[null,"Aparelho","Potência Nominal [W]","Tensão Nominal [V]","Quantidade","Tempo Ligado [h]","FP","Ip/In","Potência Total [W]","Potência de Pico [kW]","Consumo diário [Wh]"]
[1,"Laptop",100,220,2,24,{"v":1,"d":"1.0"},{"v":1,"d":"1.0"},{"$f":"IFERROR(IF(Equipmentos[[#This Row],[Quantidade]]=\"\",\"\",Equipmentos[[#This Row],[Potência Nominal '[W']]]*Equipmentos[[#This Row],[Quantidade]]/Equipmentos[[#This Row],[FP]]),\"\")","v":200},{"$f":"Equipmentos[[#This Row],[Potência Total '[W']]]*Equipmentos[[#This Row],[Ip/In]]","v":200},{"$f":"IFERROR(IF(Equipmentos[[#This Row],[Quantidade]]=\"\",\"\",Equipmentos[[#This Row],[Potência Total '[W']]]*Equipmentos[[#This Row],[Tempo Ligado '[h']]]),\"\")","v":4800}]
[2,"Modem / Wifi / Internet",20,220,1,24,{"v":1,"d":"1.0"},{"v":1,"d":"1.0"},{"$f":"IFERROR(IF(Equipmentos[[#This Row],[Quantidade]]=\"\",\"\",Equipmentos[[#This Row],[Potência Nominal '[W']]]*Equipmentos[[#This Row],[Quantidade]]/Equipmentos[[#This Row],[FP]]),\"\")","v":20},{"$f":"Equipmentos[[#This Row],[Potência Total '[W']]]*Equipmentos[[#This Row],[Ip/In]]","v":20},{"$f":"IFERROR(IF(Equipmentos[[#This Row],[Quantidade]]=\"\",\"\",Equipmentos[[#This Row],[Potência Total '[W']]]*Equipmentos[[#This Row],[Tempo Ligado '[h']]]),\"\")","v":480}]
[3,"Impressora",50,220,1,0,{"v":1,"d":"1.0"},{"v":1,"d":"1.0"},{"$f":"IFERROR(IF(Equipmentos[[#This Row],[Quantidade]]=\"\",\"\",Equipmentos[[#This Row],[Potência Nominal '[W']]]*Equipmentos[[#This Row],[Quantidade]]/Equipmentos[[#This Row],[FP]]),\"\")","v":50},{"$f":"Equipmentos[[#This Row],[Potência Total '[W']]]*Equipmentos[[#This Row],[Ip/In]]","v":50},{"$f":"IFERROR(IF(Equipmentos[[#This Row],[Quantidade]]=\"\",\"\",Equipmentos[[#This Row],[Potência Total '[W']]]*Equipmentos[[#This Row],[Tempo Ligado '[h']]]),\"\")","v":0}]
[4,"Luzes",15,220,10,6,{"v":1,"d":"1.0"},{"v":1,"d":"1.0"},{"$f":"IFERROR(IF(Equipmentos[[#This Row],[Quantidade]]=\"\",\"\",Equipmentos[[#This Row],[Potência Nominal '[W']]]*Equipmentos[[#This Row],[Quantidade]]/Equipmentos[[#This Row],[FP]]),\"\")","v":150},{"$f":"Equipmentos[[#This Row],[Potência Total '[W']]]*Equipmentos[[#This Row],[Ip/In]]","v":150},{"$f":"IFERROR(IF(Equipmentos[[#This Row],[Quantidade]]=\"\",\"\",Equipmentos[[#This Row],[Potência Total '[W']]]*Equipmentos[[#This Row],[Tempo Ligado '[h']]]),\"\")","v":900}]
[5,"TV",68,220,2,4,{"v":1,"d":"1.0"},{"v":1,"d":"1.0"},{"$f":"IFERROR(IF(Equipmentos[[#This Row],[Quantidade]]=\"\",\"\",Equipmentos[[#This Row],[Potência Nominal '[W']]]*Equipmentos[[#This Row],[Quantidade]]/Equipmentos[[#This Row],[FP]]),\"\")","v":136},{"$f":"Equipmentos[[#This Row],[Potência Total '[W']]]*Equipmentos[[#This Row],[Ip/In]]","v":136},{"$f":"IFERROR(IF(Equipmentos[[#This Row],[Quantidade]]=\"\",\"\",Equipmentos[[#This Row],[Potência Total '[W']]]*Equipmentos[[#This Row],[Tempo Ligado '[h']]]),\"\")","v":544}]
[6,"MicroOndas",800,220,1,0,{"v":1,"d":"1.0"},{"v":1,"d":"1.0"},{"$f":"IFERROR(IF(Equipmentos[[#This Row],[Quantidade]]=\"\",\"\",Equipmentos[[#This Row],[Potência Nominal '[W']]]*Equipmentos[[#This Row],[Quantidade]]/Equipmentos[[#This Row],[FP]]),\"\")","v":800},{"$f":"Equipmentos[[#This Row],[Potência Total '[W']]]*Equipmentos[[#This Row],[Ip/In]]","v":800},{"$f":"IFERROR(IF(Equipmentos[[#This Row],[Quantidade]]=\"\",\"\",Equipmentos[[#This Row],[Potência Total '[W']]]*Equipmentos[[#This Row],[Tempo Ligado '[h']]]),\"\")","v":0}]
[7,"Air Fryer",1500,220,0,0,{"v":1,"d":"1.0"},{"v":1,"d":"1.0"},{"$f":"IFERROR(IF(Equipmentos[[#This Row],[Quantidade]]=\"\",\"\",Equipmentos[[#This Row],[Potência Nominal '[W']]]*Equipmentos[[#This Row],[Quantidade]]/Equipmentos[[#This Row],[FP]]),\"\")","v":0},{"$f":"Equipmentos[[#This Row],[Potência Total '[W']]]*Equipmentos[[#This Row],[Ip/In]]","v":0},{"$f":"IFERROR(IF(Equipmentos[[#This Row],[Quantidade]]=\"\",\"\",Equipmentos[[#This Row],[Potência Total '[W']]]*Equipmentos[[#This Row],[Tempo Ligado '[h']]]),\"\")","v":0}]
[8,"Refrigerador",250,220,1,24,{"v":1,"d":"1.0"},{"v":1,"d":"1.0"},{"$f":"IFERROR(IF(Equipmentos[[#This Row],[Quantidade]]=\"\",\"\",Equipmentos[[#This Row],[Potência Nominal '[W']]]*Equipmentos[[#This Row],[Quantidade]]/Equipmentos[[#This Row],[FP]]),\"\")","v":250},{"$f":"Equipmentos[[#This Row],[Potência Total '[W']]]*Equipmentos[[#This Row],[Ip/In]]","v":250},{"$f":"IFERROR(IF(Equipmentos[[#This Row],[Quantidade]]=\"\",\"\",Equipmentos[[#This Row],[Potência Total '[W']]]*Equipmentos[[#This Row],[Tempo Ligado '[h']]]),\"\")","v":6000}]
[9,"Freezer",150,220,1,24,{"v":1,"d":"1.0"},{"v":1,"d":"1.0"},{"$f":"IFERROR(IF(Equipmentos[[#This Row],[Quantidade]]=\"\",\"\",Equipmentos[[#This Row],[Potência Nominal '[W']]]*Equipmentos[[#This Row],[Quantidade]]/Equipmentos[[#This Row],[FP]]),\"\")","v":150},{"$f":"Equipmentos[[#This Row],[Potência Total '[W']]]*Equipmentos[[#This Row],[Ip/In]]","v":150},{"$f":"IFERROR(IF(Equipmentos[[#This Row],[Quantidade]]=\"\",\"\",Equipmentos[[#This Row],[Potência Total '[W']]]*Equipmentos[[#This Row],[Tempo Ligado '[h']]]),\"\")","v":3600}]
[10,"Maquina Lavar",1500,220,1,1,{"v":1,"d":"1.0"},{"v":1,"d":"1.0"},{"$f":"IFERROR(IF(Equipmentos[[#This Row],[Quantidade]]=\"\",\"\",Equipmentos[[#This Row],[Potência Nominal '[W']]]*Equipmentos[[#This Row],[Quantidade]]/Equipmentos[[#This Row],[FP]]),\"\")","v":1500},{"$f":"Equipmentos[[#This Row],[Potência Total '[W']]]*Equipmentos[[#This Row],[Ip/In]]","v":1500},{"$f":"IFERROR(IF(Equipmentos[[#This Row],[Quantidade]]=\"\",\"\",Equipmentos[[#This Row],[Potência Total '[W']]]*Equipmentos[[#This Row],[Tempo Ligado '[h']]]),\"\")","v":1500}]
[11,"Chuveiro",7800,220,0,0.5,{"v":1,"d":"1.0"},{"v":1,"d":"1.0"},{"$f":"IFERROR(IF(Equipmentos[[#This Row],[Quantidade]]=\"\",\"\",Equipmentos[[#This Row],[Potência Nominal '[W']]]*Equipmentos[[#This Row],[Quantidade]]/Equipmentos[[#This Row],[FP]]),\"\")","v":0},{"$f":"Equipmentos[[#This Row],[Potência Total '[W']]]*Equipmentos[[#This Row],[Ip/In]]","v":0},{"$f":"IFERROR(IF(Equipmentos[[#This Row],[Quantidade]]=\"\",\"\",Equipmentos[[#This Row],[Potência Total '[W']]]*Equipmentos[[#This Row],[Tempo Ligado '[h']]]),\"\")","v":0}]
[12,"Ar Condicionado 9000 BTU",850,220,2,12,{"v":1,"d":"1.0"},{"v":1,"d":"1.0"},{"$f":"IFERROR(IF(Equipmentos[[#This Row],[Quantidade]]=\"\",\"\",Equipmentos[[#This Row],[Potência Nominal '[W']]]*Equipmentos[[#This Row],[Quantidade]]/Equipmentos[[#This Row],[FP]]),\"\")","v":1700},{"$f":"Equipmentos[[#This Row],[Potência Total '[W']]]*Equipmentos[[#This Row],[Ip/In]]","v":1700},{"$f":"IFERROR(IF(Equipmentos[[#This Row],[Quantidade]]=\"\",\"\",Equipmentos[[#This Row],[Potência Total '[W']]]*Equipmentos[[#This Row],[Tempo Ligado '[h']]]),\"\")","v":20400}]
[13,"Ar Condicionado 12000 BTU",1200,220,0,4,{"v":1,"d":"1.0"},{"v":1,"d":"1.0"},{"$f":"IFERROR(IF(Equipmentos[[#This Row],[Quantidade]]=\"\",\"\",Equipmentos[[#This Row],[Potência Nominal '[W']]]*Equipmentos[[#This Row],[Quantidade]]/Equipmentos[[#This Row],[FP]]),\"\")","v":0},{"$f":"Equipmentos[[#This Row],[Potência Total '[W']]]*Equipmentos[[#This Row],[Ip/In]]","v":0},{"$f":"IFERROR(IF(Equipmentos[[#This Row],[Quantidade]]=\"\",\"\",Equipmentos[[#This Row],[Potência Total '[W']]]*Equipmentos[[#This Row],[Tempo Ligado '[h']]]),\"\")","v":0}]
[14,"Aspirador de Pó",1400,220,0,0,{"v":1,"d":"1.0"},{"v":1,"d":"1.0"},{"$f":"IFERROR(IF(Equipmentos[[#This Row],[Quantidade]]=\"\",\"\",Equipmentos[[#This Row],[Potência Nominal '[W']]]*Equipmentos[[#This Row],[Quantidade]]/Equipmentos[[#This Row],[FP]]),\"\")","v":0},{"$f":"Equipmentos[[#This Row],[Potência Total '[W']]]*Equipmentos[[#This Row],[Ip/In]]","v":0},{"$f":"IFERROR(IF(Equipmentos[[#This Row],[Quantidade]]=\"\",\"\",Equipmentos[[#This Row],[Potência Total '[W']]]*Equipmentos[[#This Row],[Tempo Ligado '[h']]]),\"\")","v":0}]
[15,"Secador De cabelo",100,220,1,0,{"v":1,"d":"1.0"},{"v":1,"d":"1.0"},{"$f":"IFERROR(IF(Equipmentos[[#This Row],[Quantidade]]=\"\",\"\",Equipmentos[[#This Row],[Potência Nominal '[W']]]*Equipmentos[[#This Row],[Quantidade]]/Equipmentos[[#This Row],[FP]]),\"\")","v":100},{"$f":"Equipmentos[[#This Row],[Potência Total '[W']]]*Equipmentos[[#This Row],[Ip/In]]","v":100},{"$f":"IFERROR(IF(Equipmentos[[#This Row],[Quantidade]]=\"\",\"\",Equipmentos[[#This Row],[Potência Total '[W']]]*Equipmentos[[#This Row],[Tempo Ligado '[h']]]),\"\")","v":0}]
[16,"Outros",0,220,0,0,{"v":1,"d":"1.0"},{"v":1,"d":"1.0"},{"$f":"IFERROR(IF(Equipmentos[[#This Row],[Quantidade]]=\"\",\"\",Equipmentos[[#This Row],[Potência Nominal '[W']]]*Equipmentos[[#This Row],[Quantidade]]/Equipmentos[[#This Row],[FP]]),\"\")","v":0},{"$f":"Equipmentos[[#This Row],[Potência Total '[W']]]*Equipmentos[[#This Row],[Ip/In]]","v":0},{"$f":"IFERROR(IF(Equipmentos[[#This Row],[Quantidade]]=\"\",\"\",Equipmentos[[#This Row],[Potência Total '[W']]]*Equipmentos[[#This Row],[Tempo Ligado '[h']]]),\"\")","v":0}]
[]
[{"$nulls":8},{"$f":"IF(E9=\"\",\"\",SUM(I9:I24)/1000)","v":{"v":5.056,"d":"5.06"}},{"$f":"IF(F9=\"\",\"\",SUM(J9:J24)/1000)","v":{"v":5.056,"d":"5.06"}},{"$f":"SUM(K9:K24)/1000","v":{"v":38.224,"d":"38.22"}}]
[{"$nulls":8},"Potência Nominal Total [kW]","Potência de Pico Total [kW]","Consumo diário Total [kWh]"]

{"sheet":"Dados","index":3,"n_rows":88,"n_cols":18,"rows_kept":88,"hidden":true,"merged":[[34,1,34,3],[35,1,35,3],[37,1,37,3],[38,1,38,3],[39,1,39,3],[40,1,40,3],[41,1,41,3],[42,1,42,3],[43,1,43,3]]}
[]
[null,"Tensão Nominal",null,"Fox ESS name","Max Power EPS [W]","Rated Voltage [V]","Peak Power (60s)  [W]","Picture","Datasheet","Manual",null,"Qtd","Capacity EP5","Power EP5","Peak Power EP5","Capacity EP11","Power EP11","Peak Power EP11"]
[null,380,null,"H1-5.0-E-G2",5000,220,5500,{"$error":"#VALUE!"},"https://br.fox-ess.com/download/upfiles/BR-H1-G2-wl-Datasheet-V1.0-20250828.pdf","https://br.fox-ess.com/download/upfiles/PT-H1-G2-WL-Manual-V1.0.0-20250814.pdf"," ",null,5.18,null,{"$f":"Table4[[#This Row],[Power EP5]]*2.41","v":{"v":0,"d":"0.00"}},10.36,null,{"$f":"Table4[[#This Row],[Power EP11]]*2.41","v":{"v":0,"d":"0.00"}}]
[null,220,null,"KH7.5",7500,220,10000,{"$error":"#VALUE!"},"https://br.fox-ess.com/download/upfiles/BR-KH-KA-Datasheet-V1.3-20250828.pdf","https://br.fox-ess.com/download/upfiles/BR-KH-Manual-V1.0.0-20250401.pdf"," ",1,{"$f":"M$3*L4*0.9","v":{"v":4.662,"d":"4.66"}},{"$f":"M3","v":5.18},{"$f":"Table4[[#This Row],[Power EP5]]*2.41","v":{"v":12.4838,"d":"12.48"}},{"$f":"$P$3*L4*0.9","v":{"v":9.324,"d":"9.32"}},{"$f":"P3","v":10.36},{"$f":"Table4[[#This Row],[Power EP11]]*2.41","v":{"v":24.9676,"d":"24.97"}}]
[null,127,null,"KH10.5",10500,220,15000,{"$error":"#VALUE!"},"https://br.fox-ess.com/download/upfiles/BR-KH-KA-Datasheet-V1.3-20250828.pdf","https://br.fox-ess.com/download/upfiles/BR-KH-Manual-V1.0.0-20250401.pdf"," ",2,{"$f":"$M$3*L5*0.9","v":{"v":9.324,"d":"9.32"}},{"$f":"ROUNDUP(Table4[[#This Row],[Qtd]]/4,0)*192*IF($N$34>1,50,27)/1000","v":{"v":5.184,"d":"5.18"}},{"$f":"Table4[[#This Row],[Power EP5]]*2.41","v":{"v":12.493440000000001,"d":"12.49"}},{"v":18.648,"d":"18.65"},{"$f":"ROUNDUP(Table4[[#This Row],[Qtd]]/4,0)*384*IF($Q$34>1,50,27)/1000","v":{"v":10.368,"d":"10.37"}},{"$f":"Table4[[#This Row],[Power EP11]]*2.41","v":{"v":24.986880000000003,"d":"24.99"}}]
[{"$nulls":3},"H1-5.7-US",5700,"127/220",7695,{"$error":"#VALUE!"},"https://br.fox-ess.com/download/upfiles/BR-US-Datasheet-V1.0-20250517.pdf","https://br.fox-ess.com/download/upfiles/PT-US-User%20Manual-v1.2b-20250515.pdf"," ",3,{"$f":"$M$3*L6*0.9","v":{"v":13.985999999999999,"d":"13.99"}},{"$f":"ROUNDUP(Table4[[#This Row],[Qtd]]/4,0)*192*IF($N$34>1,50,27)/1000","v":{"v":5.184,"d":"5.18"}},{"$f":"Table4[[#This Row],[Power EP5]]*2.41","v":{"v":12.493440000000001,"d":"12.49"}},{"v":27.971999999999998,"d":"27.97"},{"$f":"ROUNDUP(Table4[[#This Row],[Qtd]]/4,0)*384*IF($Q$34>1,50,27)/1000","v":{"v":10.368,"d":"10.37"}},{"$f":"Table4[[#This Row],[Power EP11]]*2.41","v":{"v":24.986880000000003,"d":"24.99"}}]
[null,"Rede",null,"H1-7.5-US",7500,"127/220",10125,{"$error":"#VALUE!"},"https://br.fox-ess.com/download/upfiles/BR-US-Datasheet-V1.0-20250517.pdf","https://br.fox-ess.com/download/upfiles/PT-US-User%20Manual-v1.2b-20250515.pdf"," ",4,{"$f":"$M$3*L7*0.9","v":{"v":18.648,"d":"18.65"}},{"$f":"ROUNDUP(Table4[[#This Row],[Qtd]]/4,0)*192*IF($N$34>1,50,27)/1000","v":{"v":5.184,"d":"5.18"}},{"$f":"Table4[[#This Row],[Power EP5]]*2.41","v":{"v":12.493440000000001,"d":"12.49"}},{"v":37.296,"d":"37.30"},{"$f":"ROUNDUP(Table4[[#This Row],[Qtd]]/4,0)*384*IF($Q$34>1,50,27)/1000","v":{"v":10.368,"d":"10.37"}},{"$f":"Table4[[#This Row],[Power EP11]]*2.41","v":{"v":24.986880000000003,"d":"24.99"}}]
[null,"Monofásica (220 V)",null,"H1-11.4-US",11400,"127/220",15389,{"$error":"#VALUE!"},"https://br.fox-ess.com/download/upfiles/BR-US-Datasheet-V1.0-20250517.pdf","https://br.fox-ess.com/download/upfiles/PT-US-User%20Manual-v1.2b-20250515.pdf"," ",5,{"$f":"$M$3*L8*0.9","v":23.31},{"$f":"ROUNDUP(Table4[[#This Row],[Qtd]]/4,0)*192*IF($N$34>1,50,27)/1000","v":{"v":10.368,"d":"10.37"}},{"$f":"Table4[[#This Row],[Power EP5]]*2.41","v":{"v":24.986880000000003,"d":"24.99"}},46.62,{"$f":"ROUNDUP(Table4[[#This Row],[Qtd]]/4,0)*384*IF($Q$34>1,50,27)/1000","v":{"v":20.736,"d":"20.74"}},{"$f":"Table4[[#This Row],[Power EP11]]*2.41","v":{"v":49.973760000000006,"d":"49.97"}}]
[null,"Bifásica (127/220 V)",null,"H3-PRO-11.5",11500,220,12600,{"$error":"#VALUE!"},"https://br.fox-ess.com/download/upfiles/BR-H3-Pro-Datasheet-Low-Voltage-V1.7-20250828.pdf","https://br.fox-ess.com/download/upfiles/BR-H3-Pro-Manual-V1.0.0.pdf"," ",6,{"v":27.971999999999998,"d":"27.97"},{"$f":"ROUNDUP(Table4[[#This Row],[Qtd]]/4,0)*192*IF($N$34>1,50,27)/1000","v":{"v":10.368,"d":"10.37"}},{"$f":"Table4[[#This Row],[Power EP5]]*2.41","v":{"v":24.986880000000003,"d":"24.99"}},{"v":55.943999999999996,"d":"55.94"},{"$f":"ROUNDUP(Table4[[#This Row],[Qtd]]/4,0)*384*IF($Q$34>1,50,27)/1000","v":{"v":20.736,"d":"20.74"}},{"$f":"Table4[[#This Row],[Power EP11]]*2.41","v":{"v":49.973760000000006,"d":"49.97"}}]
[null,"Trifásica (220/380 V)",null,"H3-PRO-20.0",20000,380,24000,{"$error":"#VALUE!"},"https://br.fox-ess.com/download/upfiles/BR-H3-Pro-Datasheet-Low-Voltage-V1.7-20250828.pdf","https://br.fox-ess.com/download/upfiles/BR-H3-Pro-Manual-V1.0.0.pdf"," ",7,{"v":32.634,"d":"32.63"},{"$f":"ROUNDUP(Table4[[#This Row],[Qtd]]/4,0)*192*IF($N$34>1,50,27)/1000","v":{"v":10.368,"d":"10.37"}},{"$f":"Table4[[#This Row],[Power EP5]]*2.41","v":{"v":24.986880000000003,"d":"24.99"}},{"v":65.268,"d":"65.27"},{"$f":"ROUNDUP(Table4[[#This Row],[Qtd]]/4,0)*384*IF($Q$34>1,50,27)/1000","v":{"v":20.736,"d":"20.74"}},{"$f":"Table4[[#This Row],[Power EP11]]*2.41","v":{"v":49.973760000000006,"d":"49.97"}}]
[null,"Trifásica (127/220 V)",null,"H3-PRO-17.3",17300,220,19000,{"$error":"#VALUE!"},"https://br.fox-ess.com/download/upfiles/BR-H3-Pro-Datasheet-Low-Voltage-V1.7-20250828.pdf","https://br.fox-ess.com/download/upfiles/BR-H3-Pro-Manual-V1.0.0.pdf"," ",8,{"$f":"$M$3*L11*0.9","v":{"v":37.296,"d":"37.30"}},{"$f":"ROUNDUP(Table4[[#This Row],[Qtd]]/4,0)*192*IF($N$34>1,50,27)/1000","v":{"v":10.368,"d":"10.37"}},{"$f":"Table4[[#This Row],[Power EP5]]*2.41","v":{"v":24.986880000000003,"d":"24.99"}},{"v":74.592,"d":"74.59"},{"$f":"ROUNDUP(Table4[[#This Row],[Qtd]]/4,0)*384*IF($Q$34>1,50,27)/1000","v":{"v":20.736,"d":"20.74"}},{"$f":"Table4[[#This Row],[Power EP11]]*2.41","v":{"v":49.973760000000006,"d":"49.97"}}]
[{"$nulls":3},"H3-PRO-30.0",30000,380,36000,{"$error":"#VALUE!"},"https://br.fox-ess.com/download/upfiles/BR-H3-Pro-Datasheet-Low-Voltage-V1.7-20250828.pdf","https://br.fox-ess.com/download/upfiles/BR-H3-Pro-Manual-V1.0.0.pdf"," ",9,{"$f":"$M$3*L12*0.9","v":{"v":41.958,"d":"41.96"}},{"$f":"ROUNDUP(Table4[[#This Row],[Qtd]]/4,0)*192*IF($N$34>1,50,27)/1000","v":{"v":15.552,"d":"15.55"}},{"$f":"Table4[[#This Row],[Power EP5]]*2.41","v":{"v":37.48032,"d":"37.48"}},{"v":83.916,"d":"83.92"},{"$f":"ROUNDUP(Table4[[#This Row],[Qtd]]/4,0)*384*IF($Q$34>1,50,27)/1000","v":{"v":31.104,"d":"31.10"}},{"$f":"Table4[[#This Row],[Power EP11]]*2.41","v":{"v":74.96064,"d":"74.96"}}]
[{"$nulls":10}," ",10,46.62,{"$f":"ROUNDUP(Table4[[#This Row],[Qtd]]/4,0)*192*IF($N$34>1,50,27)/1000","v":{"v":15.552,"d":"15.55"}},{"$f":"Table4[[#This Row],[Power EP5]]*2.41","v":{"v":37.48032,"d":"37.48"}},93.24,{"$f":"ROUNDUP(Table4[[#This Row],[Qtd]]/4,0)*384*IF($Q$34>1,50,27)/1000","v":{"v":31.104,"d":"31.10"}},{"$f":"Table4[[#This Row],[Power EP11]]*2.41","v":{"v":74.96064,"d":"74.96"}}]
[null,"Other Values",null,"Fox ESS name","Especificação  Tecnologia","Tensão Nominal","Capacidade Nominal \nem 25 °C","Peso","Coluna1","Picture",null,11,{"v":51.282,"d":"51.28"},{"$f":"ROUNDUP(Table4[[#This Row],[Qtd]]/4,0)*192*IF($N$34>1,50,27)/1000","v":{"v":15.552,"d":"15.55"}},{"$f":"Table4[[#This Row],[Power EP5]]*2.41","v":{"v":37.48032,"d":"37.48"}},{"v":102.564,"d":"102.56"},{"$f":"ROUNDUP(Table4[[#This Row],[Qtd]]/4,0)*384*IF($Q$34>1,50,27)/1000","v":{"v":31.104,"d":"31.10"}},{"$f":"Table4[[#This Row],[Power EP11]]*2.41","v":{"v":74.96064,"d":"74.96"}}]
[null,1000,null,"EP5","LFP",192,27,"50.5±2",null,{"$error":"#VALUE!"},null,12,{"v":55.943999999999996,"d":"55.94"},{"$f":"ROUNDUP(Table4[[#This Row],[Qtd]]/4,0)*192*IF($N$34>1,50,27)/1000","v":{"v":15.552,"d":"15.55"}},{"$f":"Table4[[#This Row],[Power EP5]]*2.41","v":{"v":37.48032,"d":"37.48"}},{"v":111.88799999999999,"d":"111.89"},{"$f":"ROUNDUP(Table4[[#This Row],[Qtd]]/4,0)*384*IF($Q$34>1,50,27)/1000","v":{"v":31.104,"d":"31.10"}},{"$f":"Table4[[#This Row],[Power EP11]]*2.41","v":{"v":74.96064,"d":"74.96"}}]
[{"$nulls":3},"EP11","LFP",384,27,"99±2",null,{"$error":"#VALUE!"},null,13,{"v":60.606,"d":"60.61"},{"$f":"ROUNDUP(Table4[[#This Row],[Qtd]]/4,0)*192*IF($N$34>1,50,27)/1000","v":{"v":20.736,"d":"20.74"}},{"$f":"Table4[[#This Row],[Power EP5]]*2.41","v":{"v":49.973760000000006,"d":"49.97"}},{"v":121.212,"d":"121.21"},{"$f":"ROUNDUP(Table4[[#This Row],[Qtd]]/4,0)*384*IF($Q$34>1,50,27)/1000","v":{"v":41.472,"d":"41.47"}},{"$f":"Table4[[#This Row],[Power EP11]]*2.41","v":{"v":99.94752000000001,"d":"99.95"}}]
[null,1,null,"HV Junction-Box","-","-","-","-","-",{"$error":"#VALUE!"},null,14,{"v":65.268,"d":"65.27"},{"$f":"ROUNDUP(Table4[[#This Row],[Qtd]]/4,0)*192*IF($N$34>1,50,27)/1000","v":{"v":20.736,"d":"20.74"}},{"$f":"Table4[[#This Row],[Power EP5]]*2.41","v":{"v":49.973760000000006,"d":"49.97"}},{"v":130.536,"d":"130.54"},{"$f":"ROUNDUP(Table4[[#This Row],[Qtd]]/4,0)*384*IF($Q$34>1,50,27)/1000","v":{"v":41.472,"d":"41.47"}},{"$f":"Table4[[#This Row],[Power EP11]]*2.41","v":{"v":99.94752000000001,"d":"99.95"}}]
[null,2,null,"AI Link (A-1000)","-","-","-","-","-",{"$error":"#VALUE!"},null,15,{"v":69.92999999999999,"d":"69.93"},{"$f":"ROUNDUP(Table4[[#This Row],[Qtd]]/4,0)*192*IF($N$34>1,50,27)/1000","v":{"v":20.736,"d":"20.74"}},{"$f":"Table4[[#This Row],[Power EP5]]*2.41","v":{"v":49.973760000000006,"d":"49.97"}},{"v":139.85999999999999,"d":"139.86"},{"$f":"ROUNDUP(Table4[[#This Row],[Qtd]]/4,0)*384*IF($Q$34>1,50,27)/1000","v":{"v":41.472,"d":"41.47"}},{"$f":"Table4[[#This Row],[Power EP11]]*2.41","v":{"v":99.94752000000001,"d":"99.95"}}]
[null,3,null,"Quadro Baixa Tensão",{"$nulls":5},{"$error":"#VALUE!"},null,16,{"v":74.592,"d":"74.59"},{"$f":"ROUNDUP(Table4[[#This Row],[Qtd]]/4,0)*192*IF($N$34>1,50,27)/1000","v":{"v":20.736,"d":"20.74"}},{"$f":"Table4[[#This Row],[Power EP5]]*2.41","v":{"v":49.973760000000006,"d":"49.97"}},{"v":149.184,"d":"149.18"},{"$f":"ROUNDUP(Table4[[#This Row],[Qtd]]/4,0)*384*IF($Q$34>1,50,27)/1000","v":{"v":41.472,"d":"41.47"}},{"$f":"Table4[[#This Row],[Power EP11]]*2.41","v":{"v":99.94752000000001,"d":"99.95"}}]
[null,4,null,"Fox Hub G2",{"$nulls":5},{"$error":"#VALUE!"},null,17,{"v":79.254,"d":"79.25"},{"$f":"ROUNDUP(Table4[[#This Row],[Qtd]]/4,0)*192*IF($N$34>1,50,27)/1000","v":25.92},{"$f":"Table4[[#This Row],[Power EP5]]*2.41","v":{"v":62.467200000000005,"d":"62.47"}},{"v":158.508,"d":"158.51"},{"$f":"ROUNDUP(Table4[[#This Row],[Qtd]]/4,0)*384*IF($Q$34>1,50,27)/1000","v":51.84},{"$f":"Table4[[#This Row],[Power EP11]]*2.41","v":{"v":124.93440000000001,"d":"124.93"}}]
[{"$nulls":11},18,{"$f":"$M$3*L21*0.9","v":{"v":83.916,"d":"83.92"}},{"$f":"ROUNDUP(Table4[[#This Row],[Qtd]]/4,0)*192*IF($N$34>1,50,27)/1000","v":25.92},{"$f":"Table4[[#This Row],[Power EP5]]*2.41","v":{"v":62.467200000000005,"d":"62.47"}},{"v":167.832,"d":"167.83"},{"$f":"ROUNDUP(Table4[[#This Row],[Qtd]]/4,0)*384*IF($Q$34>1,50,27)/1000","v":51.84},{"$f":"Table4[[#This Row],[Power EP11]]*2.41","v":{"v":124.93440000000001,"d":"124.93"}}]
[null,"Tempo de Autonomia",{"$nulls":9},19,{"v":88.57799999999999,"d":"88.58"},{"$f":"ROUNDUP(Table4[[#This Row],[Qtd]]/4,0)*192*IF($N$34>1,50,27)/1000","v":25.92},{"$f":"Table4[[#This Row],[Power EP5]]*2.41","v":{"v":62.467200000000005,"d":"62.47"}},{"v":177.15599999999998,"d":"177.16"},{"$f":"ROUNDUP(Table4[[#This Row],[Qtd]]/4,0)*384*IF($Q$34>1,50,27)/1000","v":51.84},{"$f":"Table4[[#This Row],[Power EP11]]*2.41","v":{"v":124.93440000000001,"d":"124.93"}}]
[null,1,{"$nulls":9},20,93.24,{"$f":"ROUNDUP(Table4[[#This Row],[Qtd]]/4,0)*192*IF($N$34>1,50,27)/1000","v":25.92},{"$f":"Table4[[#This Row],[Power EP5]]*2.41","v":{"v":62.467200000000005,"d":"62.47"}},186.48,{"$f":"ROUNDUP(Table4[[#This Row],[Qtd]]/4,0)*384*IF($Q$34>1,50,27)/1000","v":51.84},{"$f":"Table4[[#This Row],[Power EP11]]*2.41","v":{"v":124.93440000000001,"d":"124.93"}}]
[null,2,{"$nulls":9},21,{"$f":"$M$3*L24*0.9","v":{"v":97.902,"d":"97.90"}},{"$f":"ROUNDUP(Table4[[#This Row],[Qtd]]/4,0)*192*IF($N$34>1,50,27)/1000","v":{"v":31.104,"d":"31.10"}},{"$f":"Table4[[#This Row],[Power EP5]]*2.41","v":{"v":74.96064,"d":"74.96"}},{"$f":"$P$3*L24*0.9","v":{"v":195.804,"d":"195.80"}},{"$f":"ROUNDUP(Table4[[#This Row],[Qtd]]/4,0)*384*IF($Q$34>1,50,27)/1000","v":{"v":62.208,"d":"62.21"}},{"$f":"Table4[[#This Row],[Power EP11]]*2.41","v":{"v":149.92128,"d":"149.92"}}]
[null,3,{"$nulls":4},{"$f":"DIMENSIONAMENTO!C7","v":"Bifásica (127/220 V)"},{"$f":"DIMENSIONAMENTO!I26*1000","v":{"v":5056,"d":"5056.00"}},{"$nulls":3},22,{"v":102.564,"d":"102.56"},{"$f":"ROUNDUP(Table4[[#This Row],[Qtd]]/4,0)*192*IF($N$34>1,50,27)/1000","v":{"v":31.104,"d":"31.10"}},{"$f":"Table4[[#This Row],[Power EP5]]*2.41","v":{"v":74.96064,"d":"74.96"}},{"v":205.128,"d":"205.13"},{"$f":"ROUNDUP(Table4[[#This Row],[Qtd]]/4,0)*384*IF($Q$34>1,50,27)/1000","v":{"v":62.208,"d":"62.21"}},{"$f":"Table4[[#This Row],[Power EP11]]*2.41","v":{"v":149.92128,"d":"149.92"}}]
[null,4,{"$nulls":9},23,{"v":107.22599999999998,"d":"107.23"},{"$f":"ROUNDUP(Table4[[#This Row],[Qtd]]/4,0)*192*IF($N$34>1,50,27)/1000","v":{"v":31.104,"d":"31.10"}},{"$f":"Table4[[#This Row],[Power EP5]]*2.41","v":{"v":74.96064,"d":"74.96"}},{"v":214.45199999999997,"d":"214.45"},{"$f":"ROUNDUP(Table4[[#This Row],[Qtd]]/4,0)*384*IF($Q$34>1,50,27)/1000","v":{"v":62.208,"d":"62.21"}},{"$f":"Table4[[#This Row],[Power EP11]]*2.41","v":{"v":149.92128,"d":"149.92"}}]
[null,5,{"$nulls":4},"Opções de Inversor",{"$nulls":4},24,{"v":111.88799999999999,"d":"111.89"},{"$f":"ROUNDUP(Table4[[#This Row],[Qtd]]/4,0)*192*IF($N$34>1,50,27)/1000","v":{"v":31.104,"d":"31.10"}},{"$f":"Table4[[#This Row],[Power EP5]]*2.41","v":{"v":74.96064,"d":"74.96"}},{"v":223.77599999999998,"d":"223.78"},{"$f":"ROUNDUP(Table4[[#This Row],[Qtd]]/4,0)*384*IF($Q$34>1,50,27)/1000","v":{"v":62.208,"d":"62.21"}},{"$f":"Table4[[#This Row],[Power EP11]]*2.41","v":{"v":149.92128,"d":"149.92"}}]
[null,6,{"$nulls":4},"Monofásica","Bifásica","Tri220","Tri380",null,25,116.55,{"$f":"ROUNDUP(Table4[[#This Row],[Qtd]]/4,0)*192*IF($N$34>1,50,27)/1000","v":{"v":36.288,"d":"36.29"}},{"$f":"Table4[[#This Row],[Power EP5]]*2.41","v":{"v":87.45407999999999,"d":"87.45"}},{"v":233.1,"d":"233.10"},{"$f":"ROUNDUP(Table4[[#This Row],[Qtd]]/4,0)*384*IF($Q$34>1,50,27)/1000","v":{"v":72.576,"d":"72.58"}},{"$f":"Table4[[#This Row],[Power EP11]]*2.41","v":{"v":174.90815999999998,"d":"174.91"}}]
[null,7,{"$nulls":3},1,{"$f":"E3","v":5000},{"$f":"$E$6*F29","v":5700},{"$f":"$E$9*F29","v":11500},{"$f":"$E$10*F29","v":20000},null,26,{"v":121.212,"d":"121.21"},{"$f":"ROUNDUP(Table4[[#This Row],[Qtd]]/4,0)*192*IF($N$34>1,50,27)/1000","v":{"v":36.288,"d":"36.29"}},{"$f":"Table4[[#This Row],[Power EP5]]*2.41","v":{"v":87.45407999999999,"d":"87.45"}},{"v":242.424,"d":"242.42"},{"$f":"ROUNDUP(Table4[[#This Row],[Qtd]]/4,0)*384*IF($Q$34>1,50,27)/1000","v":{"v":72.576,"d":"72.58"}},{"$f":"Table4[[#This Row],[Power EP11]]*2.41","v":{"v":174.90815999999998,"d":"174.91"}}]
[null,8,{"$nulls":3},2,null,null,{"$f":"$E$9*F30","v":23000},{"$f":"$E$10*F30","v":40000},null,27,{"v":125.874,"d":"125.87"},{"$f":"ROUNDUP(Table4[[#This Row],[Qtd]]/4,0)*192*IF($N$34>1,50,27)/1000","v":{"v":36.288,"d":"36.29"}},{"$f":"Table4[[#This Row],[Power EP5]]*2.41","v":{"v":87.45407999999999,"d":"87.45"}},{"v":251.748,"d":"251.75"},{"$f":"ROUNDUP(Table4[[#This Row],[Qtd]]/4,0)*384*IF($Q$34>1,50,27)/1000","v":{"v":72.576,"d":"72.58"}},{"$f":"Table4[[#This Row],[Power EP11]]*2.41","v":{"v":174.90815999999998,"d":"174.91"}}]
[null,12,{"$nulls":3},3,{"$nulls":5},28,{"v":130.536,"d":"130.54"},{"$f":"ROUNDUP(Table4[[#This Row],[Qtd]]/4,0)*192*IF($N$34>1,50,27)/1000","v":{"v":36.288,"d":"36.29"}},{"$f":"Table4[[#This Row],[Power EP5]]*2.41","v":{"v":87.45407999999999,"d":"87.45"}},{"v":261.072,"d":"261.07"},{"$f":"ROUNDUP(Table4[[#This Row],[Qtd]]/4,0)*384*IF($Q$34>1,50,27)/1000","v":{"v":72.576,"d":"72.58"}},{"$f":"Table4[[#This Row],[Power EP11]]*2.41","v":{"v":174.90815999999998,"d":"174.91"}}]
[null,24,{"$nulls":3},4,{"$nulls":5},29,{"v":135.198,"d":"135.20"},{"$f":"ROUNDUP(Table4[[#This Row],[Qtd]]/4,0)*192*IF($N$34>1,50,27)/1000","v":{"v":41.472,"d":"41.47"}},{"$f":"Table4[[#This Row],[Power EP5]]*2.41","v":{"v":99.94752000000001,"d":"99.95"}},{"v":270.396,"d":"270.40"},{"$f":"ROUNDUP(Table4[[#This Row],[Qtd]]/4,0)*384*IF($Q$34>1,50,27)/1000","v":{"v":82.944,"d":"82.94"}},{"$f":"Table4[[#This Row],[Power EP11]]*2.41","v":{"v":199.89504000000002,"d":"199.90"}}]
[{"$nulls":5},1,{"$f":"E4","v":7500},{"$f":"$E$7*F33","v":7500},{"$nulls":3},30,{"v":139.85999999999999,"d":"139.86"},{"$f":"ROUNDUP(Table4[[#This Row],[Qtd]]/4,0)*192*IF($N$34>1,50,27)/1000","v":{"v":41.472,"d":"41.47"}},{"$f":"Table4[[#This Row],[Power EP5]]*2.41","v":{"v":99.94752000000001,"d":"99.95"}},{"v":279.71999999999997,"d":"279.72"},{"$f":"ROUNDUP(Table4[[#This Row],[Qtd]]/4,0)*384*IF($Q$34>1,50,27)/1000","v":{"v":82.944,"d":"82.94"}},{"$f":"Table4[[#This Row],[Power EP11]]*2.41","v":{"v":199.89504000000002,"d":"199.90"}}]
[{"$nulls":5},2,{"$f":"G$33*$F34","v":15000},{"$f":"$E$7*F34","v":15000},{"$nulls":3},"Bat/Inv",null,{"$f":"RESULTADO!C13/RESULTADO!C10","v":{"v":1,"d":"1.00"}},null,null,{"$f":"RESULTADO!C15/RESULTADO!C10","v":{"v":1,"d":"1.00"}}]
[null,"AVISOS:",{"$nulls":3},3,{"$nulls":6},"Qtd total EP5:",{"$f":"IF(DIMENSIONAMENTO!C6=\"\",\"\",MAX(Dados!M39:M58))*H88","v":1},null,"Qtd total EP11:",{"$f":"IF(DIMENSIONAMENTO!C6=\"\",\"\",MAX(Dados!P39:P58))*H88","v":1}]
[null,"NÃO INDICADO",{"$nulls":3},4,{"$nulls":5},"Potência real:",null,{"$f":"N35*M3","v":5.18},{"$f":"N36*2.41","v":{"v":12.4838,"d":"12.48"}},null,{"$f":"Q35*P3","v":10.36},{"$f":"Q36*2.41","v":24.9676}]
[null,"NÃO INDICADO PARA BACKUP/OFF-GRID",null,null," ",5,null,37500]
[null,"PARALELISMO APENAS POSSÍVEL COM O FOX HUB (VERIFIQUE COMPATIBILIDADE)",null,null," ",1,{"$f":"E5","v":10500},{"$f":"E8","v":11400},{"$f":"$E$11*F38","v":17300},{"$f":"$E$12*F38","v":30000},null,null,"Battery Qty calc:"]
[null,"PARALELISMO APENAS POSSÍVEL COM A AI LINK",null,null," ",2,{"$f":"G$38*$F39","v":21000},{"$f":"H$38*$F39","v":22800},{"$f":"$E$11*F39","v":34600},{"$f":"$E$12*F39","v":60000},null,null,{"$f":"ROUNDUP(RESULTADO!$C$20/Dados!M4,0)","v":{"v":1,"d":"1.00"}},null,null,{"$f":"ROUNDUP(RESULTADO!$C$20/Dados!P4,0)","v":{"v":1,"d":"1.00"}}]
[null,"PARALELISMO APENAS POSSÍVEL COM A EM BOX",null,null," ",3,{"$f":"$G$38*F40","v":31500},{"$f":"H$38*$F40","v":34200},51900,90000,null,null,{"$f":"ROUNDUP(RESULTADO!$C$20/Dados!M5,0)","v":{"v":1,"d":"1.00"}},null,null,{"$f":"ROUNDUP(RESULTADO!$C$20/Dados!P5,0)","v":{"v":1,"d":"1.00"}}]
[null,"VERIFIQUE AS TENSÕES NOMINAIS DOS APARELHOS E TIPO DE REDE",null,null," ",4,42000,45600,69200,120000,null,null,{"$f":"ROUNDUP(RESULTADO!$C$20/Dados!M6,0)","v":{"v":1,"d":"1.00"}},null,null,{"$f":"ROUNDUP(RESULTADO!$C$20/Dados!P6,0)","v":{"v":1,"d":"1.00"}}]
[null,"PREENCHA O FATOR DE POTÊNCIA DE TODOS OS APARELHOS",null,null," ",5,52500,57000,86500,150000,null,null,{"$f":"ROUNDUP(RESULTADO!$C$20/Dados!M7,0)","v":{"v":1,"d":"1.00"}},null,null,{"$f":"ROUNDUP(RESULTADO!$C$20/Dados!P7,0)","v":{"v":1,"d":"1.00"}}]
[null,"PREENCHA A CORRENTE DE PICO (Ip/In) DE TODOS OS APARELHOS",null,null," ",6,63000,68400,103800,180000,null,null,{"$f":"ROUNDUP(RESULTADO!$C$20/Dados!M8,0)","v":{"v":1,"d":"1.00"}},null,null,{"$f":"ROUNDUP(RESULTADO!$C$20/Dados!P8,0)","v":{"v":1,"d":"1.00"}}]
[null,"PREENCHA A TENSÃO NOMINAL DE TODOS OS APARELHOS",null,null," ",7,73500,79800,121100,210000,null,null,{"$f":"ROUNDUP(RESULTADO!$C$20/Dados!M9,0)","v":{"v":1,"d":"1.00"}},null,null,{"$f":"ROUNDUP(RESULTADO!$C$20/Dados!P9,0)","v":{"v":1,"d":"1.00"}}]
[null,"MÁXIMO DE 4 BATERIAS POR INVERSOR, UTILIZE BATERIAS EP11",null,null,"\"      AND(B10<>Dados!D9,B10<>Dados!D10,B10<>Dados!D11,B10<>Dados!D12,Dados!M59/C10>4,C15/C10<5),Dados!B45,\"",8,84000,91200,138400,240000,null,null,{"$f":"ROUNDUP(RESULTADO!$C$20/Dados!M10,0)","v":{"v":1,"d":"1.00"}},null,null,{"$f":"ROUNDUP(RESULTADO!$C$20/Dados!P10,0)","v":{"v":1,"d":"1.00"}}]
[null,"MÁXIMO DE 4 BATERIAS POR INVERSOR, AUMENTE MANUALMENTE A QUANTIDADE DE INVERSORES",null,null," ",9,94500,102600,155700,270000,null,null,{"$f":"ROUNDUP(RESULTADO!$C$20/Dados!M11,0)","v":{"v":1,"d":"1.00"}},null,null,{"$f":"ROUNDUP(RESULTADO!$C$20/Dados!P11,0)","v":{"v":1,"d":"1.00"}}]
[null,"MÁXIMO DE 8 BATERIAS POR INVERSOR, AUMENTE MANUALMENTE A QUANTIDADE DE INVERSORES",null,null," ",10,105000,114000,173000,300000,null,null,{"$f":"ROUNDUP(RESULTADO!$C$20/Dados!M12,0)","v":{"v":1,"d":"1.00"}},null,null,{"$f":"ROUNDUP(RESULTADO!$C$20/Dados!P12,0)","v":{"v":1,"d":"1.00"}}]
[null,"JUNCTION BOX OBRIGATÓRIA APENAS EM CASO DE USO DA BATERIA EP5",null,null," ",{"$nulls":7},{"$f":"ROUNDUP(RESULTADO!$C$20/Dados!M13,0)","v":{"v":1,"d":"1.00"}},null,null,{"$f":"ROUNDUP(RESULTADO!$C$20/Dados!P13,0)","v":{"v":1,"d":"1.00"}}]
[null,"POTÊNCIA DAS BATERIAS INSUFICIENTE NO MODO OFF-GRID, CONSIDERE MAIS BATERIAS (AUMENTANDO A AUTONOMIA) OU OUTRAS FONTES DE ENERGIA (EX. FOTOVOLTAICO)",null,null," ","Mínimo viável:",{"$f":"MIN(IF(G29:G47>=$H$25,G29:G47))","v":7500},{"$f":"MIN(IF(H29:H47>=$H$25,H29:H47))","v":5700},{"$f":"MIN(IF(I29:I47>=$H$25,I29:I47))","v":11500},{"$f":"MIN(IF(J29:J47>=$H$25,J29:J47))","v":20000},null,null,{"$f":"ROUNDUP(RESULTADO!$C$20/Dados!M14,0)","v":{"v":1,"d":"1.00"}},null,null,{"$f":"ROUNDUP(RESULTADO!$C$20/Dados!P14,0)","v":{"v":1,"d":"1.00"}}]
[null,"POTÊNCIA DAS BATERIAS EP5 INSUFICIENTE NO MODO OFF-GRID, CONSIDERE MAIS BATERIAS (AUMENTANDO A AUTONOMIA), OUTRAS FONTES DE ENERGIA (EX. FOTOVOLTAICO), OU UTILIZE A EP11",null,null," ","Linha:",{"$f":"MAX(IF(G29:G47=MIN(IF(G29:G47>=$H$25, G29:G47)), ROW(G29:G47)))","v":33},{"$f":"MAX(IF(H29:H47=MIN(IF(H29:H47>=$H$25, H29:H47)), ROW(H29:H47)))","v":29},{"$f":"MAX(IF(I29:I47=MIN(IF(I29:I47>=$H$25, I29:I47)), ROW(I29:I47)))","v":29},{"$f":"MAX(IF(J29:J47=MIN(IF(J29:J47>=$H$25, J29:J47)), ROW(J29:J47)))","v":29},null,null,{"$f":"ROUNDUP(RESULTADO!$C$20/Dados!M15,0)","v":{"v":1,"d":"1.00"}},null,null,{"$f":"ROUNDUP(RESULTADO!$C$20/Dados!P15,0)","v":{"v":1,"d":"1.00"}}]
[null,"REDUZA A POTÊNCIA DE PICO, PARA REDUZIR O SISTEMA",null,null," ","Modelo:",{"$f":"_xlfn.IFS(G50<33,D3,G50<38,D4,G50<48,D5)","v":"KH7.5"},{"$f":"_xlfn.IFS(H50<33,D6,H50<38,D7,H50<48,D8)","v":"H1-5.7-US"},{"$f":"_xlfn.IFS(I50<38,D9,I50<48,D11)","v":"H3-PRO-11.5"},{"$f":"_xlfn.IFS(J50<38,D10,J50<48,D12)","v":"H3-PRO-20.0"},null,null,{"$f":"ROUNDUP(RESULTADO!$C$20/Dados!M16,0)","v":{"v":1,"d":"1.00"}},null,null,{"$f":"ROUNDUP(RESULTADO!$C$20/Dados!P16,0)","v":{"v":1,"d":"1.00"}}]
[null,"EM CASO DE BATERIAS EP5, CONSIDERE 2 JUNCTION BOX",{"$nulls":3},"Quantidade:",{"$f":"ROUNDUP(G49/VLOOKUP(G51,Products[#All],2,0),0)","v":1},{"$f":"ROUNDUP(H49/VLOOKUP(H51,Products[#All],2,0),0)","v":1},{"$f":"ROUNDUP(I49/VLOOKUP(I51,Products[#All],2,0),0)","v":1},{"$f":"ROUNDUP(J49/VLOOKUP(J51,Products[#All],2,0),0)","v":1},null,null,{"$f":"ROUNDUP(RESULTADO!$C$20/Dados!M17,0)","v":{"v":1,"d":"1.00"}},null,null,{"$f":"ROUNDUP(RESULTADO!$C$20/Dados!P17,0)","v":{"v":1,"d":"1.00"}}]
[{"$nulls":12},{"$f":"ROUNDUP(RESULTADO!$C$20/Dados!M18,0)","v":{"v":1,"d":"1.00"}},null,null,{"$f":"ROUNDUP(RESULTADO!$C$20/Dados!P18,0)","v":{"v":1,"d":"1.00"}}]
[{"$nulls":12},{"$f":"ROUNDUP(RESULTADO!$C$20/Dados!M19,0)","v":{"v":1,"d":"1.00"}},null,null,{"$f":"ROUNDUP(RESULTADO!$C$20/Dados!P19,0)","v":{"v":1,"d":"1.00"}}]
[{"$nulls":6},"CÁLCULO DE PICO",{"$f":"DIMENSIONAMENTO!J26*1000","v":{"v":5056,"d":"5056.00"}},{"$nulls":4},{"$f":"ROUNDUP(RESULTADO!$C$20/Dados!M20,0)","v":{"v":1,"d":"1.00"}},null,null,{"$f":"ROUNDUP(RESULTADO!$C$20/Dados!P20,0)","v":{"v":1,"d":"1.00"}}]
[{"$nulls":6},"Monofásica","Bifásica","Tri220","Tri380",null,null,{"$f":"ROUNDUP(RESULTADO!$C$20/Dados!M21,0)","v":{"v":1,"d":"1.00"}},null,null,{"$f":"ROUNDUP(RESULTADO!$C$20/Dados!P21,0)","v":{"v":1,"d":"1.00"}}]
[{"$nulls":5},1,{"$f":"G3","v":5500},{"$f":"$G$6*F57","v":7695},{"$f":"G$9*F57","v":12600},{"$f":"$G$10*F57","v":24000},null,null,{"$f":"ROUNDUP(RESULTADO!$C$20/Dados!M22,0)","v":{"v":1,"d":"1.00"}},null,null,{"$f":"ROUNDUP(RESULTADO!$C$20/Dados!P22,0)","v":{"v":1,"d":"1.00"}}]
[{"$nulls":5},2,null,null,{"$f":"G$9*F58","v":25200},{"$f":"$G$10*F58","v":48000},null,null,{"$f":"ROUNDUP(RESULTADO!$C$20/Dados!M23,0)","v":{"v":1,"d":"1.00"}},null,null,{"$f":"ROUNDUP(RESULTADO!$C$20/Dados!P23,0)","v":{"v":1,"d":"1.00"}}]
[{"$nulls":5},3,{"$nulls":6},{"$f":"MIN(\n    MAX(MAX(M39:M58), H88),\n    5*H88-0.000000001\n)","v":{"v":1,"d":"1.00"}},null,null,{"$f":"MIN(\n    MAX(MAX(P39:P58), H88),\n    5*H88-0.000000001\n)","v":{"v":1,"d":"1.00"}}]
[{"$nulls":5},4]
[{"$nulls":5},1,{"$f":"G4","v":10000},{"$f":"$G$7*F61","v":10125}]
[{"$nulls":5},2,{"$f":"G$4*$F62","v":20000},{"$f":"$G$7*F62","v":20250}]
[{"$nulls":5},3]
[{"$nulls":5},4]
[{"$nulls":5},5]
[{"$nulls":5},1,{"$f":"G5","v":15000},{"$f":"$G$8*F66","v":15389},{"$f":"$G$11*F66","v":19000},{"$f":"$G$12*F66","v":36000}]
[{"$nulls":5},2,{"$f":"G$5*$F67","v":30000},{"$f":"$G$8*F67","v":30778},{"$f":"$G$11*F67","v":38000},{"$f":"$G$12*F67","v":72000}]
[{"$nulls":5},3,{"$f":"G$5*$F68","v":45000},46167,57000,108000]
[{"$nulls":5},4,60000,61556,76000,144000]
[{"$nulls":5},5,75000,76945,95000,180000]
[{"$nulls":5},6,90000,92334,114000,216000]
[{"$nulls":5},7,105000,107723,133000,252000]
[{"$nulls":5},8,120000,123112,152000,288000]
[{"$nulls":5},9,135000,138501,171000,324000]
[{"$nulls":5},10,150000,153890,190000,360000]
[]
[{"$nulls":5},"Mínimo viável:",{"$f":"MIN(IF(G57:G75>=$H$55,G57:G75))","v":5500},{"$f":"MIN(IF(H57:H75>=$H$55,H57:H75))","v":7695},{"$f":"MIN(IF(I57:I75>=$H$55,I57:I75))","v":12600},{"$f":"MIN(IF(J57:J75>=$H$55,J57:J75))","v":24000}]
[{"$nulls":5},"Linha:",{"$f":"MAX(IF(G57:G75=MIN(IF(G57:G75>=$H$25, G57:G75)), ROW(G57:G75)))","v":57},{"$f":"MAX(IF(H57:H75=MIN(IF(H57:H75>=$H$25, H57:H75)), ROW(H57:H75)))","v":57},{"$f":"MAX(IF(I57:I75=MIN(IF(I57:I75>=$H$25, I57:I75)), ROW(I57:I75)))","v":57},{"$f":"MAX(IF(J57:J75=MIN(IF(J57:J75>=$H$25, J57:J75)), ROW(J57:J75)))","v":57}]
[{"$nulls":5},"Modelo:",{"$f":"_xlfn.IFS(G78<61,D3,G78<66,D4,G78<76,D5)","v":"H1-5.0-E-G2"},{"$f":"_xlfn.IFS(H78<61,D6,H78<66,D7,H78<76,D8)","v":"H1-5.7-US"},{"$f":"_xlfn.IFS(I78<61,D9,I78<76,D11)","v":"H3-PRO-11.5"},{"$f":"_xlfn.IFS(J78<61,D10,J78<76,D12)","v":"H3-PRO-20.0"}]
[{"$nulls":5},"Quantidade:",{"$f":"ROUNDUP(G77/VLOOKUP(G79,Products[#All],4,0),0)","v":1},{"$f":"ROUNDUP(H77/VLOOKUP(H79,Products[#All],4,0),0)","v":1},{"$f":"ROUNDUP(I77/VLOOKUP(I79,Products[#All],4,0),0)","v":1},{"$f":"ROUNDUP(J77/VLOOKUP(J79,Products[#All],4,0),0)","v":1}]
[]
[]
[]
[{"$nulls":6},"Check Pico:"]
[{"$nulls":5},"Pelo Nominal:",{"$f":"_xlfn.IFS(DIMENSIONAMENTO!C7=Dados!B8,Dados!G51,DIMENSIONAMENTO!C7=Dados!B9,Dados!H51,DIMENSIONAMENTO!C7=Dados!B10,Dados!J51,DIMENSIONAMENTO!C7=Dados!B11,Dados!I51)","v":"H1-5.7-US"},{"$f":"_xlfn.IFS(DIMENSIONAMENTO!C7=Dados!B8,Dados!G52,DIMENSIONAMENTO!C7=Dados!B9,Dados!H52,DIMENSIONAMENTO!C7=Dados!B10,Dados!J52,DIMENSIONAMENTO!C7=Dados!B11,Dados!I52)","v":1}]
[{"$nulls":5},"Pelo Pico:",{"$f":"_xlfn.IFS(DIMENSIONAMENTO!C7=Dados!B8,G79,DIMENSIONAMENTO!C7=Dados!B9,Dados!H79,DIMENSIONAMENTO!C7=Dados!B10,Dados!J79,DIMENSIONAMENTO!C7=Dados!B11,Dados!I79)","v":"H1-5.7-US"},{"$f":"_xlfn.IFS(DIMENSIONAMENTO!C7=Dados!B8,Dados!G80,DIMENSIONAMENTO!C7=Dados!B9,Dados!H80,DIMENSIONAMENTO!C7=Dados!B10,Dados!J80,DIMENSIONAMENTO!C7=Dados!B11,Dados!I80)","v":1},null,{"$f":"MAX(VLOOKUP(G85,Products[#All],4,0),VLOOKUP(G86,Products[#All],4,0))","v":7695}]
[]
[{"$nulls":5},"Final:",{"$f":"IF(VLOOKUP(G85,Products[#All],4,0)*H85>H55,G85,G86)","v":"H1-5.7-US"},{"$f":"MAX(H85:H86)","v":1}]

{"sheet":"RESULTADO","index":4,"n_rows":24,"n_cols":13,"rows_kept":24,"merged":[[0,1,3,13],[5,4,5,6],[5,8,10,9],[6,1,6,2],[6,4,6,6],[6,12,8,12],[7,1,8,1],[7,2,8,2],[7,4,8,6],[9,4,10,6],[11,4,11,6],[11,9,12,10],[12,4,13,6],[13,1,13,2],[13,8,13,9],[14,8,17,9],[14,12,17,13]]}
[null,"CALCULADORA BACKUP FOX ESS"]
[]
[]
[]
[]
[{"$nulls":4},"AVISOS:",{"$nulls":3},{"$f":"VLOOKUP(B10,Dados!D2:J12,5,0)","v":{"$error":"#VALUE!"}}]
[null,"Lista de Produtos",null,null,{"$f":"_xlfn.IFNA(\n   _xlfn.IFS(\n      AND(OR(B10=Dados!D9,B10=Dados!D10,B10=Dados!D11,B10=Dados!D12),(Dados!M59/RESULTADO!C10)>8),Dados!B47,\n      AND(OR(B10=Dados!D3,B10=Dados!D4,B10=Dados!D5,B10=Dados!D6,B10=Dados!D7,B10=Dados!D8),(Dados!P59/RESULTADO!C10)>4),Dados!B46,\n      AND(AND(B10<>Dados!D9,B10<>Dados!D10,B10<>Dados!D11,B10<>Dados!D12),C15/C10<2,Dados!M59/C10>1,C13<>\"\"),Dados!B48,\n      AND(OR(B10=Dados!D9,B10=Dados!D10,B10=Dados!D11,B1=Dados!D12),C15/C10<3,Dados!M59/C10>2,C13<>\"\"),Dados!B48,\n      AND(OR(B10=Dados!D9,B10=Dados!D10,B10=Dados!D11,B1=Dados!D12),C15<5,C13>5,C13<>\"\"),Dados!B52\n   ),\n   \"\"\n)","v":""},{"$nulls":7},{"$f":"IFERROR(_xlfn.IFS(E8=Dados!B38,Dados!J20,E8=Dados!B39,Dados!J18),\"\")","v":""}]
[null,"Modelo","Quantidade",null,{"$f":"_xlfn.IFS(C10>10,Dados!B36,C10<2,\"\",C10>4,Dados!B37,B10=Dados!D6,Dados!B38,B10=Dados!D7,Dados!B38,B10=Dados!D8,Dados!B38,B10=Dados!D9,Dados!B39,B10=Dados!D11,Dados!B39,B10=Dados!D10,Dados!B39,B10=Dados!D12,Dados!B39,B10=Dados!D3,\"\",B10=Dados!D4,\"\",B10=Dados!D5,\"\")","v":""},{"$nulls":5},{"$f":"IF(M7=\"\",\"\",\"+\")","v":""}]
[]
[null,{"$f":"Dados!G88","v":"H1-5.7-US"},{"$f":"Dados!H88","v":1},null,{"$f":"_xlfn.IFS(\n   COUNTBLANK(DIMENSIONAMENTO!H8:H24)>0, Dados!B43,\n   COUNTBLANK(DIMENSIONAMENTO!D8:D24)>0, Dados!B44,\n   COUNTBLANK(DIMENSIONAMENTO!G8:G24)>0, Dados!B42,\n   OR(\n      AND(DIMENSIONAMENTO!C7=Dados!B8, OR(COUNTIF(Equipmentos[Tensão Nominal '[V']],127)>0, COUNTIF(Equipmentos[Tensão Nominal '[V']],380)>0)),\n      AND(DIMENSIONAMENTO!C7=Dados!B9, COUNTIF(Equipmentos[Tensão Nominal '[V']],380)>0),\n      AND(DIMENSIONAMENTO!C7=Dados!B10, COUNTIF(Equipmentos[Tensão Nominal '[V']],127)>0),\n      AND(DIMENSIONAMENTO!C7=Dados!B11, COUNTIF(Equipmentos[Tensão Nominal '[V']],380)>0)\n   ), Dados!B41,\n   TRUE, \"\"\n)","v":""}]
[null,{"$f":"_xlfn.IFNA(\n_xlfn.IFS(\nAND(B10<>Dados!D3,B10<>Dados!D4,B10<>Dados!D5,B10<>Dados!D6,B10<>Dados!D7,B10<>Dados!D8,Dados!M59<3),\"\",\nAND(B10<>Dados!D3,B10<>Dados!D4,B10<>Dados!D5,B10<>Dados!D6,B10<>Dados!D7,B10<>Dados!D8,Dados!M59<6),Dados!D17,\nAND(OR(B10=Dados!D3,B10=Dados!D4,B10=Dados!D5,B10=Dados!D6,B10=Dados!D7,B10=Dados!D8),C15/C10>1),Dados!D17,\nAND(OR(B10=Dados!D3,B10=Dados!D4,B10=Dados!D5,B10=Dados!D6,B10=Dados!D7,B10=Dados!D8),Dados!M59/C10>1),Dados!D17,\nC13<=1,\"\"),\"\")","v":""},{"$f":"IFERROR(\n    IF(\n        B11=\"HV Junction-Box\",\n        IF(\n            OR(B10=Dados!D3,B10=Dados!D4,B10=Dados!D5,B10=Dados!D6,B10=Dados!D7,B10=Dados!D8),\n            C10,\n            IF(AND(Dados!P59<6,Dados!P59>2),1,ROUNDUP(C15/4,0)*C10)\n        ),\n        \"\"\n    ),\n    \"\"\n)","v":""}]
[null,{"$f":"IFERROR(_xlfn.IFS(E8=Dados!B38,Dados!D20,E8=Dados!B39,Dados!D18),\"\")","v":""},{"$f":"IF(B12=\"\",\"\",\"1.00\")","v":""},null,"DICAS:",{"$nulls":4},{"$f":"IF(C11=\"\",\"\",Dados!J17)","v":""}]
[null,{"$f":"IF(\n    OR(\n        Dados!M59*Dados!M4<C20,\n        AND(COUNTIF(Dados!D9:D12,B10)=0, Dados!M59/C10>4),\n        AND(COUNTIF(Dados!D9:D12,B10)>0, Dados!M59/C10>8)\n    ),\n    \"\",\n    Dados!D15\n)","v":"EP5"},{"$f":"IF(B13=\"\",\"\",ROUNDUP(Dados!M59/Dados!H88,0)*Dados!H88)","v":1},null,{"$f":"_xlfn.IFNA(_xlfn.IFS(C18>=F22,Dados!B49,\nC18>=F18,Dados!B50,\nOR(Dados!H88>Dados!H85,Dados!G88<>Dados!G85),Dados!B51),\"\")","v":""}]
[null,{"$f":"IF(B13<>\"\",\"OU\",\"\")","v":"OU"}]
[null,{"$f":"Dados!D16","v":"EP11"},{"$f":"ROUNDUP(Dados!P59/Dados!H88,0)*Dados!H88","v":1},{"$nulls":5},{"$f":"IF(B13=\"\",\"\",Dados!J15)","v":{"$error":"#VALUE!"}},{"$nulls":3},{"$f":"VLOOKUP(B15,Products8[#All],7,)","v":{"$error":"#VALUE!"}}]
[{"$nulls":4},"Potência Alcançada (Inversor) [kW]",{"$f":"IFERROR(VLOOKUP(B10,Products[#All],MATCH(Products[[#Headers],[Max Power EPS '[W']]],Products[#Headers],0),FALSE)*C10/1000,\"\")","v":{"v":5.7,"d":"5.70"}}]
[{"$nulls":10},{"$f":"B14","v":"OU"}]
[null,"Potência Necessária (kW)",{"$f":"DIMENSIONAMENTO!I26","v":{"v":5.056,"d":"5.06"}},null,"Potência Alcançada EP5 [kW]",{"$f":"IF(C13=\"\",\"\",Dados!N36)","v":5.18}]
[null,"Autonomia Desejada [h]",{"$f":"DIMENSIONAMENTO!C6","v":2},null,"Autonomia Alcançada (EP5 - plena carga) [h]",{"$f":"IF(C13=\"\",\"\",F20*C19/C20)","v":{"v":2.9271661783172878,"d":"2.93"}}]
[null,"Capacidade Necessária (kWh)",{"$f":"IF(DIMENSIONAMENTO!K26=0,\"\",DIMENSIONAMENTO!K26/24*DIMENSIONAMENTO!C6)","v":{"v":3.185333333333333,"d":"3.19"}},null,"Capacidade Alcançada (EP5) [kWh]",{"$f":"IF(C13=\"\",\"\",C13*Dados!M4)","v":{"v":4.662,"d":"4.66"}}]
[]
[{"$nulls":4},"Potência Alcançada EP11 [kW]",{"$f":"Dados!Q36","v":10.36}]
[{"$nulls":4},"Autonomia Alcançada (EP11 - plena carga) [h]",{"$f":"F24*C19/C20","v":{"v":5.8543323566345755,"d":"5.85"}}]
[{"$nulls":4},"Capacidade Alcançada (EP11) [kWh]",{"$f":"C15*Dados!P4","v":{"v":9.324,"d":"9.32"}}]