{"text_format":"3","workbook":"xlsx","n_sheets":5,"sheets":["COMECE AQUI - LEIA ATENTAMENTE ","INSTRUÇÕES DE USO","DIMENSIONAMENTO","Dados","RESULTADO"],"not_rendered":{"images":11},"read":"whole","date_system":"1900"}

{"sheet":"COMECE AQUI - LEIA ATENTAMENTE ","index":0,"n_rows":6,"n_cols":13,"rows_kept":6,"merged":[[0,1,2,21],[4,1,4,10],[4,12,4,21],[5,1,18,10],[5,12,18,21]]}
[null,"CALCULADORA BACKUP FOX ESS"]
[]
[]
[]
[null,"TERMOS DE USO E RECOMENDAÇÕES",{"$nulls":10},"OS CÁLCULOS DESTE ARQUIVO NÃO CONSIDERAM:"]
[null,"A Calculadora de Backup da Fox ESS foi desenvolvida para auxiliar, de forma educativa, no pré-dimensionamento de soluções de backup de energia. Ressaltamos que os resultados gerados são apenas estimativas e não substituem um projeto técnico profissional. A Fox ESS não se responsabiliza por eventuais inadequações decorrentes do uso desta ferramenta. Para garantir que o sistema atenda plenamente às suas demandas, é indispensável a análise de um engenheiro ou especialista qualificado. Ter um sistema híbrido bem dimensionado é essencial para manter a continuidade de energia em aplicações residenciais, comerciais e industriais.\nA autonomia máxima considerada nesta ferramenta é de 24h.",{"$nulls":10},"- Alimentação das cargas por outras fontes (Ex. Fotovoltaico/Solar, Gerador Diesel, Etc);\n   \n- Coeficiente de simultaniedade das cargas (A planilha considera tudo ligado ao mesmo tempo);\n   \n- Eficiência de inversores e baterias;\n   \n- Corrente Recomendada e tempo de carregamento das baterias."]

{"sheet":"INSTRUÇÕES DE USO","index":1,"n_rows":6,"n_cols":2,"rows_kept":6,"merged":[[0,1,2,10],[4,1,4,10],[5,1,18,10]]}
[null,"CALCULADORA BACKUP FOX ESS"]
[]
[]
[]
[null,"INSTRUÇÕES"]
[null,"Para o uso desta planilha, é extremamente importante que seja feito um levantamento prévio das cargas que serão alimentadas pelo sistema.\n\n1 - A planilha é previamente preenchida com dados de exemplo que devem ser alterados de acordo com os dados do cliente.\n2 - Na aba de Dimensionamento, selecione dentre as opções disponíveis, o tempo de autonomia desejado pelo cliente\n3 - Selecione o Tipo de Rede do cliente dentre as opções disponíveis.\n4 - Preencha a Lista de Equipamentos  nos campos editáveis (em roxo), de acordo com o levantamento feito. Ajuste os nomes dos aparelhos, potências, quantidades, o tempo de uso, o Fator de Potênica (FP -  cargas 100% reativas como Notebook e Roteador tem FP = 1) e a Corrente de Pico (Ip/In) conforme necessário.\nNOTA1: As células que ficarem amarelas e/ou vermelhas, servem como um mero indicativo de potência mais alta (acima de 1kW) ou consumo alto.\nNOTA2: Por padrão a planilha considera DoD (Profundidade de Descarga) das baterias de 90%, sem perdas.\n5 - Após todas as informações preenchidas, a planilha apresenta na aba RESULTADO, o modelo de inversor e a quantidade sugerida, assim como a quantidade de baterias recomendadas por inversor. Agora é só conferir o kit com o distribuidor de sua preferência e ser feliz com a Fox ESS!\n\nLEMBRE-SE: Essa calculadora foi desenvolvida para auxiliar no pré-dimensionamento de soluções de backup de energia e ressaltamos que os resultados gerados são apenas estimativas e não substituem um projeto técnico profissional. Para garantir que o sistema atenda plenamente às suas demandas, é indispensável a análise de um engenheiro ou especialista qualificado. A Fox-ESS não se responsabiliza por eventuais inadequações decorrentes do uso desta ferramenta.\n"]

{"sheet":"DIMENSIONAMENTO","index":2,"n_rows":27,"n_cols":11,"rows_kept":27,"merged":[[0,1,3,11]]}
[null,"CALCULADORA BACKUP FOX ESS"]
[]
[]
[]
[null,null,"Campos Editáveis"]
[null,"Autonomia  ( Horas)",2]
[null,"Tipo de rede do Cliente:","Bifásica (127/220 V)"]
[null,"Aparelho","Potência Nominal [W]","Tensão Nominal [V]","Quantidade","Tempo Ligado [h]","FP","Ip/In","Potência Total [W]","Potência de Pico [kW]","Consumo diário [Wh]"]
[1,"Laptop",100,220,2,24,{"v":1,"d":"1.0"},{"v":1,"d":"1.0"},{"$f":"IFERROR(IF(Equipmentos[[#This Row],[Quantidade]]=\"\",\"\",Equipmentos[[#This Row],[Potência Nominal '[W']]]*Equipmentos[[#This Row],[Quantidade]]/Equipmentos[[#This Row],[FP]]),\"\")","v":200},{"$f":"Equipmentos[[#This Row],[Potência Total '[W']]]*Equipmentos[[#This Row],[Ip/In]]","v":200},{"$f":"IFERROR(IF(Equipmentos[[#This Row],[Quantidade]]=\"\",\"\",Equipmentos[[#This Row],[Potência Total '[W']]]*Equipmentos[[#This Row],[Tempo Ligado '[h']]]),\"\")","v":4800}]
[2,"Modem / Wifi / Internet",20,220,1,24,{"v":1,"d":"1.0"},{"v":1,"d":"1.0"},{"$f":"IFERROR(IF(Equipmentos[[#This Row],[Quantidade]]=\"\",\"\",Equipmentos[[#This Row],[Potência Nominal '[W']]]*Equipmentos[[#This Row],[Quantidade]]/Equipmentos[[#This Row],[FP]]),\"\")","v":20},{"$f":"Equipmentos[[#This Row],[Potência Total '[W']]]*Equipmentos[[#This Row],[Ip/In]]","v":20},{"$f":"IFERROR(IF(Equipmentos[[#This Row],[Quantidade]]=\"\",\"\",Equipmentos[[#This Row],[Potência Total '[W']]]*Equipmentos[[#This Row],[Tempo Ligado '[h']]]),\"\")","v":480}]
[3,"Impressora",50,220,1,0,{"v":1,"d":"1.0"},{"v":1,"d":"1.0"},{"$f":"IFERROR(IF(Equipmentos[[#This Row],[Quantidade]]=\"\",\"\",Equipmentos[[#This Row],[Potência Nominal '[W']]]*Equipmentos[[#This Row],[Quantidade]]/Equipmentos[[#This Row],[FP]]),\"\")","v":50},{"$f":"Equipmentos[[#This Row],[Potência Total '[W']]]*Equipmentos[[#This Row],[Ip/In]]","v":50},{"$f":"IFERROR(IF(Equipmentos[[#This Row],[Quantidade]]=\"\",\"\",Equipmentos[[#This Row],[Potência Total '[W']]]*Equipmentos[[#This Row],[Tempo Ligado '[h']]]),\"\")","v":0}]
[4,"Luzes",15,220,10,6,{"v":1,"d":"1.0"},{"v":1,"d":"1.0"},{"$f":"IFERROR(IF(Equipmentos[[#This Row],[Quantidade]]=\"\",\"\",Equipmentos[[#This Row],[Potência Nominal '[W']]]*Equipmentos[[#This Row],[Quantidade]]/Equipmentos[[#This Row],[FP]]),\"\")","v":150},{"$f":"Equipmentos[[#This Row],[Potência Total '[W']]]*Equipmentos[[#This Row],[Ip/In]]","v":150},{"$f":"IFERROR(IF(Equipmentos[[#This Row],[Quantidade]]=\"\",\"\",Equipmentos[[#This Row],[Potência Total '[W']]]*Equipmentos[[#This Row],[Tempo Ligado '[h']]]),\"\")","v":900}]
[5,"TV",68,220,2,4,{"v":1,"d":"1.0"},{"v":1,"d":"1.0"},{"$f":"IFERROR(IF(Equipmentos[[#This Row],[Quantidade]]=\"\",\"\",Equipmentos[[#This Row],[Potência Nominal '[W']]]*Equipmentos[[#This Row],[Quantidade]]/Equipmentos[[#This Row],[FP]]),\"\")","v":136},{"$f":"Equipmentos[[#This Row],[Potência Total '[W']]]*Equipmentos[[#This Row],[Ip/In]]","v":136},{"$f":"IFERROR(IF(Equipmentos[[#This Row],[Quantidade]]=\"\",\"\",Equipmentos[[#This Row],[Potência Total '[W']]]*Equipmentos[[#This Row],[Tempo Ligado '[h']]]),\"\")","v":544}]
[6,"MicroOndas",800,220,1,0,{"v":1,"d":"1.0"},{"v":1,"d":"1.0"},{"$f":"IFERROR(IF(Equipmentos[[#This Row],[Quantidade]]=\"\",\"\",Equipmentos[[#This Row],[Potência Nominal '[W']]]*Equipmentos[[#This Row],[Quantidade]]/Equipmentos[[#This Row],[FP]]),\"\")","v":800},{"$f":"Equipmentos[[#This Row],[Potência Total '[W']]]*Equipmentos[[#This Row],[Ip/In]]","v":800},{"$f":"IFERROR(IF(Equipmentos[[#This Row],[Quantidade]]=\"\",\"\",Equipmentos[[#This Row],[Potência Total '[W']]]*Equipmentos[[#This Row],[Tempo Ligado '[h']]]),\"\")","v":0}]
[7,"Air Fryer",1500,220,0,0,{"v":1,"d":"1.0"},{"v":1,"d":"1.0"},{"$f":"IFERROR(IF(Equipmentos[[#This Row],[Quantidade]]=\"\",\"\",Equipmentos[[#This Row],[Potência Nominal '[W']]]*Equipmentos[[#This Row],[Quantidade]]/Equipmentos[[#This Row],[FP]]),\"\")","v":0},{"$f":"Equipmentos[[#This Row],[Potência Total '[W']]]*Equipmentos[[#This Row],[Ip/In]]","v":0},{"$f":"IFERROR(IF(Equipmentos[[#This Row],[Quantidade]]=\"\",\"\",Equipmentos[[#This Row],[Potência Total '[W']]]*Equipmentos[[#This Row],[Tempo Ligado '[h']]]),\"\")","v":0}]
{"$rows_left_out":13}
{"sheet":"Dados","index":3,"n_rows":88,"n_cols":18,"rows_kept":88,"hidden":true,"merged":[[34,1,34,3],[35,1,35,3],[37,1,37,3],[38,1,38,3],[39,1,39,3],[40,1,40,3],[41,1,41,3],[42,1,42,3],[43,1,43,3]]}
[]
[null,"Tensão Nominal",null,"Fox ESS name","Max Power EPS [W]","Rated Voltage [V]","Peak Power (60s)  [W]","Picture","Datasheet","Manual",null,"Qtd","Capacity EP5","Power EP5","Peak Power EP5","Capacity EP11","Power EP11","Peak Power EP11"]
[null,380,null,"H1-5.0-E-G2",5000,220,5500,{"$error":"#VALUE!"},"https://br.fox-ess.com/download/upfiles/BR-H1-G2-wl-Datasheet-V1.0-20250828.pdf","https://br.fox-ess.com/download/upfiles/PT-H1-G2-WL-Manual-V1.0.0-20250814.pdf"," ",null,5.18,null,{"$f":"Table4[[#This Row],[Power EP5]]*2.41","v":{"v":0,"d":"0.00"}},10.36,null,{"$f":"Table4[[#This Row],[Power EP11]]*2.41","v":{"v":0,"d":"0.00"}}]
[null,220,null,"KH7.5",7500,220,10000,{"$error":"#VALUE!"},"https://br.fox-ess.com/download/upfiles/BR-KH-KA-Datasheet-V1.3-20250828.pdf","https://br.fox-ess.com/download/upfiles/BR-KH-Manual-V1.0.0-20250401.pdf"," ",1,{"$f":"M$3*L4*0.9","v":{"v":4.662,"d":"4.66"}},{"$f":"M3","v":5.18},{"$f":"Table4[[#This Row],[Power EP5]]*2.41","v":{"v":12.4838,"d":"12.48"}},{"$f":"$P$3*L4*0.9","v":{"v":9.324,"d":"9.32"}},{"$f":"P3","v":10.36},{"$f":"Table4[[#This Row],[Power EP11]]*2.41","v":{"v":24.9676,"d":"24.97"}}]
[null,127,null,"KH10.5",10500,220,15000,{"$error":"#VALUE!"},"https://br.fox-ess.com/download/upfiles/BR-KH-KA-Datasheet-V1.3-20250828.pdf","https://br.fox-ess.com/download/upfiles/BR-KH-Manual-V1.0.0-20250401.pdf"," ",2,{"$f":"$M$3*L5*0.9","v":{"v":9.324,"d":"9.32"}},{"$f":"ROUNDUP(Table4[[#This Row],[Qtd]]/4,0)*192*IF($N$34>1,50,27)/1000","v":{"v":5.184,"d":"5.18"}},{"$f":"Table4[[#This Row],[Power EP5]]*2.41","v":{"v":12.493440000000001,"d":"12.49"}},{"v":18.648,"d":"18.65"},{"$f":"ROUNDUP(Table4[[#This Row],[Qtd]]/4,0)*384*IF($Q$34>1,50,27)/1000","v":{"v":10.368,"d":"10.37"}},{"$f":"Table4[[#This Row],[Power EP11]]*2.41","v":{"v":24.986880000000003,"d":"24.99"}}]
[{"$nulls":3},"H1-5.7-US",5700,"127/220",7695,{"$error":"#VALUE!"},"https://br.fox-ess.com/download/upfiles/BR-US-Datasheet-V1.0-20250517.pdf","https://br.fox-ess.com/download/upfiles/PT-US-User%20Manual-v1.2b-20250515.pdf"," ",3,{"$f":"$M$3*L6*0.9","v":{"v":13.985999999999999,"d":"13.99"}},{"$f":"ROUNDUP(Table4[[#This Row],[Qtd]]/4,0)*192*IF($N$34>1,50,27)/1000","v":{"v":5.184,"d":"5.18"}},{"$f":"Table4[[#This Row],[Power EP5]]*2.41","v":{"v":12.493440000000001,"d":"12.49"}},{"v":27.971999999999998,"d":"27.97"},{"$f":"ROUNDUP(Table4[[#This Row],[Qtd]]/4,0)*384*IF($Q$34>1,50,27)/1000","v":{"v":10.368,"d":"10.37"}},{"$f":"Table4[[#This Row],[Power EP11]]*2.41","v":{"v":24.986880000000003,"d":"24.99"}}]
[null,"Rede",null,"H1-7.5-US",7500,"127/220",10125,{"$error":"#VALUE!"},"https://br.fox-ess.com/download/upfiles/BR-US-Datasheet-V1.0-20250517.pdf","https://br.fox-ess.com/download/upfiles/PT-US-User%20Manual-v1.2b-20250515.pdf"," ",4,{"$f":"$M$3*L7*0.9","v":{"v":18.648,"d":"18.65"}},{"$f":"ROUNDUP(Table4[[#This Row],[Qtd]]/4,0)*192*IF($N$34>1,50,27)/1000","v":{"v":5.184,"d":"5.18"}},{"$f":"Table4[[#This Row],[Power EP5]]*2.41","v":{"v":12.493440000000001,"d":"12.49"}},{"v":37.296,"d":"37.30"},{"$f":"ROUNDUP(Table4[[#This Row],[Qtd]]/4,0)*384*IF($Q$34>1,50,27)/1000","v":{"v":10.368,"d":"10.37"}},{"$f":"Table4[[#This Row],[Power EP11]]*2.41","v":{"v":24.986880000000003,"d":"24.99"}}]
[null,"Monofásica (220 V)",null,"H1-11.4-US",11400,"127/220",15389,{"$error":"#VALUE!"},"https://br.fox-ess.com/download/upfiles/BR-US-Datasheet-V1.0-20250517.pdf","https://br.fox-ess.com/download/upfiles/PT-US-User%20Manual-v1.2b-20250515.pdf"," ",5,{"$f":"$M$3*L8*0.9","v":23.31},{"$f":"ROUNDUP(Table4[[#This Row],[Qtd]]/4,0)*192*IF($N$34>1,50,27)/1000","v":{"v":10.368,"d":"10.37"}},{"$f":"Table4[[#This Row],[Power EP5]]*2.41","v":{"v":24.986880000000003,"d":"24.99"}},46.62,{"$f":"ROUNDUP(Table4[[#This Row],[Qtd]]/4,0)*384*IF($Q$34>1,50,27)/1000","v":{"v":20.736,"d":"20.74"}},{"$f":"Table4[[#This Row],[Power EP11]]*2.41","v":{"v":49.973760000000006,"d":"49.97"}}]
[null,"Bifásica (127/220 V)",null,"H3-PRO-11.5",11500,220,12600,{"$error":"#VALUE!"},"https://br.fox-ess.com/download/upfiles/BR-H3-Pro-Datasheet-Low-Voltage-V1.7-20250828.pdf","https://br.fox-ess.com/download/upfiles/BR-H3-Pro-Manual-V1.0.0.pdf"," ",6,{"v":27.971999999999998,"d":"27.97"},{"$f":"ROUNDUP(Table4[[#This Row],[Qtd]]/4,0)*192*IF($N$34>1,50,27)/1000","v":{"v":10.368,"d":"10.37"}},{"$f":"Table4[[#This Row],[Power EP5]]*2.41","v":{"v":24.986880000000003,"d":"24.99"}},{"v":55.943999999999996,"d":"55.94"},{"$f":"ROUNDUP(Table4[[#This Row],[Qtd]]/4,0)*384*IF($Q$34>1,50,27)/1000","v":{"v":20.736,"d":"20.74"}},{"$f":"Table4[[#This Row],[Power EP11]]*2.41","v":{"v":49.973760000000006,"d":"49.97"}}]
[null,"Trifásica (220/380 V)",null,"H3-PRO-20.0",20000,380,24000,{"$error":"#VALUE!"},"https://br.fox-ess.com/download/upfiles/BR-H3-Pro-Datasheet-Low-Voltage-V1.7-20250828.pdf","https://br.fox-ess.com/download/upfiles/BR-H3-Pro-Manual-V1.0.0.pdf"," ",7,{"v":32.634,"d":"32.63"},{"$f":"ROUNDUP(Table4[[#This Row],[Qtd]]/4,0)*192*IF($N$34>1,50,27)/1000","v":{"v":10.368,"d":"10.37"}},{"$f":"Table4[[#This Row],[Power EP5]]*2.41","v":{"v":24.986880000000003,"d":"24.99"}},{"v":65.268,"d":"65.27"},{"$f":"ROUNDUP(Table4[[#This Row],[Qtd]]/4,0)*384*IF($Q$34>1,50,27)/1000","v":{"v":20.736,"d":"20.74"}},{"$f":"Table4[[#This Row],[Power EP11]]*2.41","v":{"v":49.973760000000006,"d":"49.97"}}]
[null,"Trifásica (127/220 V)",null,"H3-PRO-17.3",17300,220,19000,{"$error":"#VALUE!"},"https://br.fox-ess.com/download/upfiles/BR-H3-Pro-Datasheet-Low-Voltage-V1.7-20250828.pdf","https://br.fox-ess.com/download/upfiles/BR-H3-Pro-Manual-V1.0.0.pdf"," ",8,{"$f":"$M$3*L11*0.9","v":{"v":37.296,"d":"37.30"}},{"$f":"ROUNDUP(Table4[[#This Row],[Qtd]]/4,0)*192*IF($N$34>1,50,27)/1000","v":{"v":10.368,"d":"10.37"}},{"$f":"Table4[[#This Row],[Power EP5]]*2.41","v":{"v":24.986880000000003,"d":"24.99"}},{"v":74.592,"d":"74.59"},{"$f":"ROUNDUP(Table4[[#This Row],[Qtd]]/4,0)*384*IF($Q$34>1,50,27)/1000","v":{"v":20.736,"d":"20.74"}},{"$f":"Table4[[#This Row],[Power EP11]]*2.41","v":{"v":49.973760000000006,"d":"49.97"}}]
[{"$nulls":3},"H3-PRO-30.0",30000,380,36000,{"$error":"#VALUE!"},"https://br.fox-ess.com/download/upfiles/BR-H3-Pro-Datasheet-Low-Voltage-V1.7-20250828.pdf","https://br.fox-ess.com/download/upfiles/BR-H3-Pro-Manual-V1.0.0.pdf"," ",9,{"$f":"$M$3*L12*0.9","v":{"v":41.958,"d":"41.96"}},{"$f":"ROUNDUP(Table4[[#This Row],[Qtd]]/4,0)*192*IF($N$34>1,50,27)/1000","v":{"v":15.552,"d":"15.55"}},{"$f":"Table4[[#This Row],[Power EP5]]*2.41","v":{"v":37.48032,"d":"37.48"}},{"v":83.916,"d":"83.92"},{"$f":"ROUNDUP(Table4[[#This Row],[Qtd]]/4,0)*384*IF($Q$34>1,50,27)/1000","v":{"v":31.104,"d":"31.10"}},{"$f":"Table4[[#This Row],[Power EP11]]*2.41","v":{"v":74.96064,"d":"74.96"}}]
[{"$nulls":10}," ",10,46.62,{"$f":"ROUNDUP(Table4[[#This Row],[Qtd]]/4,0)*192*IF($N$34>1,50,27)/1000","v":{"v":15.552,"d":"15.55"}},{"$f":"Table4[[#This Row],[Power EP5]]*2.41","v":{"v":37.48032,"d":"37.48"}},93.24,{"$f":"ROUNDUP(Table4[[#This Row],[Qtd]]/4,0)*384*IF($Q$34>1,50,27)/1000","v":{"v":31.104,"d":"31.10"}},{"$f":"Table4[[#This Row],[Power EP11]]*2.41","v":{"v":74.96064,"d":"74.96"}}]
[null,"Other Values",null,"Fox ESS name","Especificação  Tecnologia","Tensão Nominal","Capacidade Nominal \nem 25 °C","Peso","Coluna1","Picture",null,11,{"v":51.282,"d":"51.28"},{"$f":"ROUNDUP(Table4[[#This Row],[Qtd]]/4,0)*192*IF($N$34>1,50,27)/1000","v":{"v":15.552,"d":"15.55"}},{"$f":"Table4[[#This Row],[Power EP5]]*2.41","v":{"v":37.48032,"d":"37.48"}},{"v":102.564,"d":"102.56"},{"$f":"ROUNDUP(Table4[[#This Row],[Qtd]]/4,0)*384*IF($Q$34>1,50,27)/1000","v":{"v":31.104,"d":"31.10"}},{"$f":"Table4[[#This Row],[Power EP11]]*2.41","v":{"v":74.96064,"d":"74.96"}}]
[null,1000,null,"EP5","LFP",192,27,"50.5±2",null,{"$error":"#VALUE!"},null,12,{"v":55.943999999999996,"d":"55.94"},{"$f":"ROUNDUP(Table4[[#This Row],[Qtd]]/4,0)*192*IF($N$34>1,50,27)/1000","v":{"v":15.552,"d":"15.55"}},{"$f":"Table4[[#This Row],[Power EP5]]*2.41","v":{"v":37.48032,"d":"37.48"}},{"v":111.88799999999999,"d":"111.89"},{"$f":"ROUNDUP(Table4[[#This Row],[Qtd]]/4,0)*384*IF($Q$34>1,50,27)/1000","v":{"v":31.104,"d":"31.10"}},{"$f":"Table4[[#This Row],[Power EP11]]*2.41","v":{"v":74.96064,"d":"74.96"}}]
{"$rows_left_out":74}
{"sheet":"RESULTADO","index":4,"n_rows":24,"n_cols":13,"rows_kept":24,"merged":[[0,1,3,13],[5,4,5,6],[5,8,10,9],[6,1,6,2],[6,4,6,6],[6,12,8,12],[7,1,8,1],[7,2,8,2],[7,4,8,6],[9,4,10,6],[11,4,11,6],[11,9,12,10],[12,4,13,6],[13,1,13,2],[13,8,13,9],[14,8,17,9],[14,12,17,13]]}
[null,"CALCULADORA BACKUP FOX ESS"]
[]
[]
[]
[]
[{"$nulls":4},"AVISOS:",{"$nulls":3},{"$f":"VLOOKUP(B10,Dados!D2:J12,5,0)","v":{"$error":"#VALUE!"}}]
[null,"Lista de Produtos",null,null,{"$f":"_xlfn.IFNA(\n   _xlfn.IFS(\n      AND(OR(B10=Dados!D9,B10=Dados!D10,B10=Dados!D11,B10=Dados!D12),(Dados!M59/RESULTADO!C10)>8),Dados!B47,\n      AND(OR(B10=Dados!D3,B10=Dados!D4,B10=Dados!D5,B10=Dados!D6,B10=Dados!D7,B10=Dados!D8),(Dados!P59/RESULTADO!C10)>4),Dados!B46,\n      AND(AND(B10<>Dados!D9,B10<>Dados!D10,B10<>Dados!D11,B10<>Dados!D12),C15/C10<2,Dados!M59/C10>1,C13<>\"\"),Dados!B48,\n      AND(OR(B10=Dados!D9,B10=Dados!D10,B10=Dados!D11,B1=Dados!D12),C15/C10<3,Dados!M59/C10>2,C13<>\"\"),Dados!B48,\n      AND(OR(B10=Dados!D9,B10=Dados!D10,B10=Dados!D11,B1=Dados!D12),C15<5,C13>5,C13<>\"\"),Dados!B52\n   ),\n   \"\"\n)","v":""},{"$nulls":7},{"$f":"IFERROR(_xlfn.IFS(E8=Dados!B38,Dados!J20,E8=Dados!B39,Dados!J18),\"\")","v":""}]
[null,"Modelo","Quantidade",null,{"$f":"_xlfn.IFS(C10>10,Dados!B36,C10<2,\"\",C10>4,Dados!B37,B10=Dados!D6,Dados!B38,B10=Dados!D7,Dados!B38,B10=Dados!D8,Dados!B38,B10=Dados!D9,Dados!B39,B10=Dados!D11,Dados!B39,B10=Dados!D10,Dados!B39,B10=Dados!D12,Dados!B39,B10=Dados!D3,\"\",B10=Dados!D4,\"\",B10=Dados!D5,\"\")","v":""},{"$nulls":5},{"$f":"IF(M7=\"\",\"\",\"+\")","v":""}]
[]
[null,{"$f":"Dados!G88","v":"H1-5.7-US"},{"$f":"Dados!H88","v":1},null,{"$f":"_xlfn.IFS(\n   COUNTBLANK(DIMENSIONAMENTO!H8:H24)>0, Dados!B43,\n   COUNTBLANK(DIMENSIONAMENTO!D8:D24)>0, Dados!B44,\n   COUNTBLANK(DIMENSIONAMENTO!G8:G24)>0, Dados!B42,\n   OR(\n      AND(DIMENSIONAMENTO!C7=Dados!B8, OR(COUNTIF(Equipmentos[Tensão Nominal '[V']],127)>0, COUNTIF(Equipmentos[Tensão Nominal '[V']],380)>0)),\n      AND(DIMENSIONAMENTO!C7=Dados!B9, COUNTIF(Equipmentos[Tensão Nominal '[V']],380)>0),\n      AND(DIMENSIONAMENTO!C7=Dados!B10, COUNTIF(Equipmentos[Tensão Nominal '[V']],127)>0),\n      AND(DIMENSIONAMENTO!C7=Dados!B11, COUNTIF(Equipmentos[Tensão Nominal '[V']],380)>0)\n   ), Dados!B41,\n   TRUE, \"\"\n)","v":""}]
[null,{"$f":"_xlfn.IFNA(\n_xlfn.IFS(\nAND(B10<>Dados!D3,B10<>Dados!D4,B10<>Dados!D5,B10<>Dados!D6,B10<>Dados!D7,B10<>Dados!D8,Dados!M59<3),\"\",\nAND(B10<>Dados!D3,B10<>Dados!D4,B10<>Dados!D5,B10<>Dados!D6,B10<>Dados!D7,B10<>Dados!D8,Dados!M59<6),Dados!D17,\nAND(OR(B10=Dados!D3,B10=Dados!D4,B10=Dados!D5,B10=Dados!D6,B10=Dados!D7,B10=Dados!D8),C15/C10>1),Dados!D17,\nAND(OR(B10=Dados!D3,B10=Dados!D4,B10=Dados!D5,B10=Dados!D6,B10=Dados!D7,B10=Dados!D8),Dados!M59/C10>1),Dados!D17,\nC13<=1,\"\"),\"\")","v":""},{"$f":"IFERROR(\n    IF(\n        B11=\"HV Junction-Box\",\n        IF(\n            OR(B10=Dados!D3,B10=Dados!D4,B10=Dados!D5,B10=Dados!D6,B10=Dados!D7,B10=Dados!D8),\n            C10,\n            IF(AND(Dados!P59<6,Dados!P59>2),1,ROUNDUP(C15/4,0)*C10)\n        ),\n        \"\"\n    ),\n    \"\"\n)","v":""}]
[null,{"$f":"IFERROR(_xlfn.IFS(E8=Dados!B38,Dados!D20,E8=Dados!B39,Dados!D18),\"\")","v":""},{"$f":"IF(B12=\"\",\"\",\"1.00\")","v":""},null,"DICAS:",{"$nulls":4},{"$f":"IF(C11=\"\",\"\",Dados!J17)","v":""}]
[null,{"$f":"IF(\n    OR(\n        Dados!M59*Dados!M4<C20,\n        AND(COUNTIF(Dados!D9:D12,B10)=0, Dados!M59/C10>4),\n        AND(COUNTIF(Dados!D9:D12,B10)>0, Dados!M59/C10>8)\n    ),\n    \"\",\n    Dados!D15\n)","v":"EP5"},{"$f":"IF(B13=\"\",\"\",ROUNDUP(Dados!M59/Dados!H88,0)*Dados!H88)","v":1},null,{"$f":"_xlfn.IFNA(_xlfn.IFS(C18>=F22,Dados!B49,\nC18>=F18,Dados!B50,\nOR(Dados!H88>Dados!H85,Dados!G88<>Dados!G85),Dados!B51),\"\")","v":""}]
[null,{"$f":"IF(B13<>\"\",\"OU\",\"\")","v":"OU"}]
[null,{"$f":"Dados!D16","v":"EP11"},{"$f":"ROUNDUP(Dados!P59/Dados!H88,0)*Dados!H88","v":1},{"$nulls":5},{"$f":"IF(B13=\"\",\"\",Dados!J15)","v":{"$error":"#VALUE!"}},{"$nulls":3},{"$f":"VLOOKUP(B15,Products8[#All],7,)","v":{"$error":"#VALUE!"}}]
{"$rows_left_out":9}