{"text_format":"3","workbook":"xlsx","n_sheets":6,"sheets":["COMECE AQUI - LEIA ATENTAMENTE ","INSTRUÇÕES DE USO","DIMENSIONAMENTO","RESULTADO","Dados","Exemplo 2"],"not_rendered":{"images":12},"read":"whole","date_system":"1900"}

{"sheet":"COMECE AQUI - LEIA ATENTAMENTE ","index":0,"n_rows":6,"n_cols":13,"rows_kept":6,"merged":[[0,1,2,21],[4,1,4,10],[4,12,4,21],[5,1,18,10],[5,12,18,21]]}
[null,"CALCULADORA BACKUP FOX ESS"]
[]
[]
[]
[null,"TERMOS DE USO E RECOMENDAÇÕES",{"$nulls":10},"OS CÁLCULOS DESTE ARQUIVO NÃO CONSIDERAM:"]
[null,"A Calculadora de Sistemas Híbridos da Fox ESS foi desenvolvida para auxiliar, de forma educativa, no pré-dimensionamento de soluções de backup de energia. Ressaltamos que os resultados gerados são apenas estimativas e não substituem um projeto técnico profissional. A Fox ESS não se responsabiliza por eventuais inadequações decorrentes do uso desta ferramenta. Para garantir que o sistema atenda plenamente às suas demandas, é indispensável a análise de um engenheiro ou especialista qualificado. Ter um sistema híbrido bem dimensionado é essencial para manter a continuidade de energia em aplicações residenciais, comerciais e industriais.\nA autonomia máxima considerada nesta ferramenta é de 24h.",{"$nulls":10},"- Corrente de pico das cargas\n- Alimentação das cargas por outras fontes (Ex. Fotovoltaico/Solar, Gerador Diesel, Etc)\n- Coeficiente de simultaniedade das cargas \n- Eficiência de inversores e baterias\n- Correntes Máxima e Recomendada das baterias\n- Fator de Potência das cargas"]

{"sheet":"INSTRUÇÕES DE USO","index":1,"n_rows":6,"n_cols":2,"rows_kept":6,"merged":[[0,1,2,10],[4,1,4,10],[5,1,18,10]]}
[null,"CALCULADORA BACKUP FOX ESS"]
[]
[]
[]
[null,"INSTRUÇÕES"]
[null,"Para o uso desta planilha, é extremamente importante que seja feito um levantamento prévio das cargas que serão alimentadas pelo sistema.\n\n1 - A planilha é previamente preenchida com dados de exemplo que devem ser alterados de acordo com os dados do cliente.\n2 - Na aba de Dimensionamento, selecione o Tipo de Rede do cliente dentre as opções disponíveis na linha 6. \n3 - Preencha a Lista de Equipamentos  nos campos editáveis (em roxo) da aba de DIMENSIONAMENTO, de acordo com o levantamento feito. Ajuste os nomes dos aparelhos, potências, quantidades e tempo de uso conforme necessário.\nNOTA1: As células que ficarem amarelas servem como um mero indicativo de potência mais alta (acima de 1kW) ou consumo alto.\n4 - Indique a autonomia desejada de acordo com a necessidade do cliente dentre as opções disponíveis na coluna J.\nNOTA2: Por padrão a planilha considera DoD (Profundidade de Descarga) das baterias de 90%, sem perdas.\n5 - Após todas as informações preenchidas, a planilha apresenta na aba RESULTADO, o modelo de inversor e a quantidade sugerida, assim como a quantidade de baterias recomendadas por inversor. Agora é só conferir o kit com o distribuidor de sua preferência e ser feliz com a Fox ESS!\n\nLEMBRE-SE: Essa calculadora foi desenvolvida para auxiliar no pré-dimensionamento de soluções de backup de energia e ressaltamos que os resultados gerados são apenas estimativas e não substituem um projeto técnico profissional. Para garantir que o sistema atenda plenamente às suas demandas, é indispensável a análise de um engenheiro ou especialista qualificado. A Fox-ESS não se responsabiliza por eventuais inadequações decorrentes do uso desta ferramenta.\n"]

{"sheet":"DIMENSIONAMENTO","index":2,"n_rows":27,"n_cols":13,"rows_kept":27,"merged":[[0,1,3,12],[7,10,7,12],[8,10,9,11],[8,12,9,12],[10,10,11,11],[10,12,11,12],[12,10,12,12],[13,10,14,12],[15,10,16,12],[17,10,18,12],[20,10,21,12]]}
[null,"CALCULADORA BACKUP FOX ESS"]
[]
[]
[]
[null,null,"Campos Editáveis"]
[null,"Autonomia  ( Horas)",4]
[null,"Tipo de rede do Cliente:","Bifásica (127/220 V)"]
[null,"Aparelho","Potência Nominal [W]","Tensão Nominal [V]","Quantidade","Tempo Ligado [h]","Potência Total (W)","Column1","Consumo diário (kWh)",null,"Inversores"]
[1,"Laptop",100,220,2,24,{"$f":"IFERROR(IF(Equipmentos[[#This Row],[Quantidade]]=\"\",\"\",Equipmentos[[#This Row],[Potência Nominal '[W']]]*Equipmentos[[#This Row],[Quantidade]]),\"\")","v":200},null,{"$f":"IFERROR(IF(Equipmentos[[#This Row],[Quantidade]]=\"\",\"\",Equipmentos[[#This Row],[Potência Total (W)]]*Equipmentos[[#This Row],[Tempo Ligado '[h']]]/1000),\"\")","v":4.8},null,"Quantidade",null,"Modelo"]
[2,"Modem / Wifi / Internet",20,220,1,24,{"$f":"IFERROR(IF(Equipmentos[[#This Row],[Quantidade]]=\"\",\"\",Equipmentos[[#This Row],[Potência Nominal '[W']]]*Equipmentos[[#This Row],[Quantidade]]),\"\")","v":20},null,{"$f":"IFERROR(IF(Equipmentos[[#This Row],[Quantidade]]=\"\",\"\",Equipmentos[[#This Row],[Potência Total (W)]]*Equipmentos[[#This Row],[Tempo Ligado '[h']]]/1000),\"\")","v":0.48}]
[3,"Impressora",50,220,1,0,{"$f":"IFERROR(IF(Equipmentos[[#This Row],[Quantidade]]=\"\",\"\",Equipmentos[[#This Row],[Potência Nominal '[W']]]*Equipmentos[[#This Row],[Quantidade]]),\"\")","v":50},null,{"$f":"IFERROR(IF(Equipmentos[[#This Row],[Quantidade]]=\"\",\"\",Equipmentos[[#This Row],[Potência Total (W)]]*Equipmentos[[#This Row],[Tempo Ligado '[h']]]/1000),\"\")","v":0},null,{"$f":"_xlfn.IFS(C7=Dados!B8,Dados!G52,C7=Dados!B9,Dados!H52,C7=Dados!B10,Dados!J52,C7=Dados!B11,Dados!I52)","v":1},null,{"$f":"_xlfn.IFS(C7=Dados!B8,Dados!G51,C7=Dados!B9,Dados!H51,C7=Dados!B10,Dados!J51,C7=Dados!B11,Dados!I51)","v":"H1-11.4-US"}]
[4,"Luzes",15,220,10,6,{"$f":"IFERROR(IF(Equipmentos[[#This Row],[Quantidade]]=\"\",\"\",Equipmentos[[#This Row],[Potência Nominal '[W']]]*Equipmentos[[#This Row],[Quantidade]]),\"\")","v":150},null,{"$f":"IFERROR(IF(Equipmentos[[#This Row],[Quantidade]]=\"\",\"\",Equipmentos[[#This Row],[Potência Total (W)]]*Equipmentos[[#This Row],[Tempo Ligado '[h']]]/1000),\"\")","v":0.9}]
[5,"TV",68,220,2,4,{"$f":"IFERROR(IF(Equipmentos[[#This Row],[Quantidade]]=\"\",\"\",Equipmentos[[#This Row],[Potência Nominal '[W']]]*Equipmentos[[#This Row],[Quantidade]]),\"\")","v":136},null,{"$f":"IFERROR(IF(Equipmentos[[#This Row],[Quantidade]]=\"\",\"\",Equipmentos[[#This Row],[Potência Total (W)]]*Equipmentos[[#This Row],[Tempo Ligado '[h']]]/1000),\"\")","v":0.544},null,"AVISOS:"]
[6,"MicroOndas",800,220,1,0,{"$f":"IFERROR(IF(Equipmentos[[#This Row],[Quantidade]]=\"\",\"\",Equipmentos[[#This Row],[Potência Nominal '[W']]]*Equipmentos[[#This Row],[Quantidade]]),\"\")","v":800},null,{"$f":"IFERROR(IF(Equipmentos[[#This Row],[Quantidade]]=\"\",\"\",Equipmentos[[#This Row],[Potência Total (W)]]*Equipmentos[[#This Row],[Tempo Ligado '[h']]]/1000),\"\")","v":0},null,{"$f":"IF(K25>4,\"MÁXIMO DE 4 BATERIAS POR INVERSOR, AUMENTE MANUALMENTE A QUANTIDADE DE INVERSORES\",\"\")","v":""}]
[7,"Air Fryer",1500,220,1,0,{"$f":"IFERROR(IF(Equipmentos[[#This Row],[Quantidade]]=\"\",\"\",Equipmentos[[#This Row],[Potência Nominal '[W']]]*Equipmentos[[#This Row],[Quantidade]]),\"\")","v":1500},null,{"$f":"IFERROR(IF(Equipmentos[[#This Row],[Quantidade]]=\"\",\"\",Equipmentos[[#This Row],[Potência Total (W)]]*Equipmentos[[#This Row],[Tempo Ligado '[h']]]/1000),\"\")","v":0}]
[8,"Refrigerador",250,220,1,24,{"$f":"IFERROR(IF(Equipmentos[[#This Row],[Quantidade]]=\"\",\"\",Equipmentos[[#This Row],[Potência Nominal '[W']]]*Equipmentos[[#This Row],[Quantidade]]),\"\")","v":250},null,{"$f":"IFERROR(IF(Equipmentos[[#This Row],[Quantidade]]=\"\",\"\",Equipmentos[[#This Row],[Potência Total (W)]]*Equipmentos[[#This Row],[Tempo Ligado '[h']]]/1000),\"\")","v":6},null,{"$f":"_xlfn.IFS(K11>10,Dados!B36, K11<2,\"\",K11>4,Dados!C37,M11=Dados!D6,Dados!B38,M11=Dados!D7,Dados!B38,M11=Dados!D8,Dados!B38,M11=Dados!D9,Dados!B39,M11=Dados!D11,Dados!B39,M11=Dados!D10,Dados!B40,M11=Dados!D3,\"\",M11=Dados!D4,\"\",M11=Dados!D5,\"\")","v":""}]
[9,"Freezer",150,220,1,24,{"$f":"IFERROR(IF(Equipmentos[[#This Row],[Quantidade]]=\"\",\"\",Equipmentos[[#This Row],[Potência Nominal '[W']]]*Equipmentos[[#This Row],[Quantidade]]),\"\")","v":150},null,{"$f":"IFERROR(IF(Equipmentos[[#This Row],[Quantidade]]=\"\",\"\",Equipmentos[[#This Row],[Potência Total (W)]]*Equipmentos[[#This Row],[Tempo Ligado '[h']]]/1000),\"\")","v":3.6}]
[10,"Maquina Lavar",1500,220,1,1,{"$f":"IFERROR(IF(Equipmentos[[#This Row],[Quantidade]]=\"\",\"\",Equipmentos[[#This Row],[Potência Nominal '[W']]]*Equipmentos[[#This Row],[Quantidade]]),\"\")","v":1500},null,{"$f":"IFERROR(IF(Equipmentos[[#This Row],[Quantidade]]=\"\",\"\",Equipmentos[[#This Row],[Potência Total (W)]]*Equipmentos[[#This Row],[Tempo Ligado '[h']]]/1000),\"\")","v":1.5},null,{"$f":"IF(\n   OR(\n      AND(C7=Dados!B8, OR(COUNTIF(Equipmentos[Tensão Nominal '[V']],127)>0, COUNTIF(Equipmentos[Tensão Nominal '[V']],380)>0)),\n      AND(C7=Dados!B9, COUNTIF(Equipmentos[Tensão Nominal '[V']],380)>0),\n      AND(C7=Dados!B10, COUNTIF(Equipmentos[Tensão Nominal '[V']],127)>0),\n      AND(C7=Dados!B11, COUNTIF(Equipmentos[Tensão Nominal '[V']],380)>0)\n   ),\n   Dados!B41,\n   \"\"\n)","v":""}]
[11,"Chuveiro",7800,220,0,0.5,{"$f":"IFERROR(IF(Equipmentos[[#This Row],[Quantidade]]=\"\",\"\",Equipmentos[[#This Row],[Potência Nominal '[W']]]*Equipmentos[[#This Row],[Quantidade]]),\"\")","v":0},null,{"$f":"IFERROR(IF(Equipmentos[[#This Row],[Quantidade]]=\"\",\"\",Equipmentos[[#This Row],[Potência Total (W)]]*Equipmentos[[#This Row],[Tempo Ligado '[h']]]/1000),\"\")","v":0}]
[12,"Ar Condicionado 9000 BTU",850,220,1,2,{"$f":"IFERROR(IF(Equipmentos[[#This Row],[Quantidade]]=\"\",\"\",Equipmentos[[#This Row],[Potência Nominal '[W']]]*Equipmentos[[#This Row],[Quantidade]]),\"\")","v":850},null,{"$f":"IFERROR(IF(Equipmentos[[#This Row],[Quantidade]]=\"\",\"\",Equipmentos[[#This Row],[Potência Total (W)]]*Equipmentos[[#This Row],[Tempo Ligado '[h']]]/1000),\"\")","v":1.7}]
[13,"Ar Condicionado 12000 BTU",1000,220,1,0,{"$f":"IFERROR(IF(Equipmentos[[#This Row],[Quantidade]]=\"\",\"\",Equipmentos[[#This Row],[Potência Nominal '[W']]]*Equipmentos[[#This Row],[Quantidade]]),\"\")","v":1000},null,{"$f":"IFERROR(IF(Equipmentos[[#This Row],[Quantidade]]=\"\",\"\",Equipmentos[[#This Row],[Potência Total (W)]]*Equipmentos[[#This Row],[Tempo Ligado '[h']]]/1000),\"\")","v":0},null,"BATERIAS POR INVERSOR"]
[14,"Aspirador de Pó",1400,220,1,0,{"$f":"IFERROR(IF(Equipmentos[[#This Row],[Quantidade]]=\"\",\"\",Equipmentos[[#This Row],[Potência Nominal '[W']]]*Equipmentos[[#This Row],[Quantidade]]),\"\")","v":1400},null,{"$f":"IFERROR(IF(Equipmentos[[#This Row],[Quantidade]]=\"\",\"\",Equipmentos[[#This Row],[Potência Total (W)]]*Equipmentos[[#This Row],[Tempo Ligado '[h']]]/1000),\"\")","v":0}]
[15,"Secador De cabelo",100,220,1,0,{"$f":"IFERROR(IF(Equipmentos[[#This Row],[Quantidade]]=\"\",\"\",Equipmentos[[#This Row],[Potência Nominal '[W']]]*Equipmentos[[#This Row],[Quantidade]]),\"\")","v":100},null,{"$f":"IFERROR(IF(Equipmentos[[#This Row],[Quantidade]]=\"\",\"\",Equipmentos[[#This Row],[Potência Total (W)]]*Equipmentos[[#This Row],[Tempo Ligado '[h']]]/1000),\"\")","v":0},null,"EP5",null,"EP11"]
[null,"Outros",0,220,0,0,{"$f":"IFERROR(IF(Equipmentos[[#This Row],[Quantidade]]=\"\",\"\",Equipmentos[[#This Row],[Potência Nominal '[W']]]*Equipmentos[[#This Row],[Quantidade]]),\"\")","v":0},null,{"$f":"IFERROR(IF(Equipmentos[[#This Row],[Quantidade]]=\"\",\"\",Equipmentos[[#This Row],[Potência Total (W)]]*Equipmentos[[#This Row],[Tempo Ligado '[h']]]/1000),\"\")","v":0},null,"5KWH",null,"10 KWH"]
[{"$nulls":10},{"$f":"IF(C6=\"\",\"\",MAX(Dados!P8:P11))","v":1},"OU",{"$f":"IF(C6=\"\",\"\",MAX(Dados!R8:R11))","v":1}]
[{"$nulls":6},{"$f":"IF(E9=\"\",\"\",SUM(G9:G24)/1000)","v":{"v":8.106,"d":"8.11"}},null,{"$f":"SUM(I9:I23)","v":{"v":19.524,"d":"19.52"}}]
[{"$nulls":6},"Potência Nominal Total [kW]",null,"Consumo diário Total [kWh]"]

{"sheet":"RESULTADO","index":3,"n_rows":20,"n_cols":10,"rows_kept":20,"merged":[[0,1,3,6],[5,6,10,7],[6,1,6,2],[6,9,9,9],[7,1,8,1],[7,2,8,2],[7,3,7,5],[8,3,9,5],[10,3,11,5],[11,7,12,8],[12,3,13,5],[13,1,13,2],[13,6,13,7],[14,6,17,7],[14,9,17,10]]}
[null,"CALCULADORA BACKUP "]
[]
[]
[]
[]
[{"$nulls":6},{"$f":"VLOOKUP(RESULTADO!B10,Products[#All],MATCH(Products[[#Headers],[Picture]],Products[#Headers],0),FALSE)","v":{"$error":"#VALUE!"}}]
[null,"Lista de Produtos",{"$nulls":7},{"$f":"IFERROR(_xlfn.IFS(DIMENSIONAMENTO!K16=Dados!B38,Dados!J20,DIMENSIONAMENTO!K16=Dados!B39,Dados!J18),\"\")","v":""}]
[null,"Modelo","Quantidade","AVISOS:",{"$nulls":4},{"$f":"IF(J7=\"\",\"\",\"+\")","v":""}]
[{"$nulls":3},{"$f":"DIMENSIONAMENTO!K14","v":""}]
[null,{"$f":"DIMENSIONAMENTO!M11","v":"H1-11.4-US"},{"$f":"DIMENSIONAMENTO!K11","v":{"v":1,"d":"1.00"}}]
[null,{"$f":"IF(DIMENSIONAMENTO!M25>1,Dados!D17,\"\")","v":""},{"$f":"IFERROR(IF(B11=\"HV Junction-Box\",ROUNDUP(DIMENSIONAMENTO!M25/4,0),\"\")*C10,\"\")","v":""},{"$f":"DIMENSIONAMENTO!K16","v":""}]
[null,{"$f":"IFERROR(_xlfn.IFS(DIMENSIONAMENTO!K16=Dados!B38,Dados!D20,DIMENSIONAMENTO!K16=Dados!B39,Dados!D18),\"\")","v":""},{"$f":"IF(B12=\"\",\"\",\"1.00\")","v":""},{"$nulls":4},{"$f":"IF(C11>=1,Dados!J17,\"\")","v":{"$error":"#VALUE!"}}]
[null,{"$f":"DIMENSIONAMENTO!M23","v":"EP11"},{"$f":"DIMENSIONAMENTO!M25*DIMENSIONAMENTO!K11","v":{"v":1,"d":"1.00"}},{"$f":"DIMENSIONAMENTO!K18","v":""}]
[null,"OU"]
[null,{"$f":"DIMENSIONAMENTO!K23","v":"EP5"},{"$f":"DIMENSIONAMENTO!K25*DIMENSIONAMENTO!K11","v":{"v":1,"d":"1.00"}},{"$nulls":3},{"$f":"Dados!J15","v":{"$error":"#VALUE!"}},null,null,{"$f":"VLOOKUP(DIMENSIONAMENTO!M23,Products8[#All],7,)","v":{"$error":"#VALUE!"}}]
[]
[{"$nulls":8},"OU"]
[null,"Autonomia Desejada",{"$f":"DIMENSIONAMENTO!C6","v":4},"Autonomia Alcançada (plena carga) [h]",{"$f":"E19*C18/C19","v":{"v":11.461585740626921,"d":"11.46"}}]
[null,"Capacidade Necessária (kWh)",{"$f":"IF(DIMENSIONAMENTO!I26=0,\"\",DIMENSIONAMENTO!I26/24*DIMENSIONAMENTO!C6)","v":{"v":3.254,"d":"3.25"}},"Capacidade Alcançada (kWh)",{"$f":"RESULTADO!C13*Dados!Q4","v":{"v":9.324,"d":"9.32"}}]
[null,"Potência Necessária (kW)",{"$f":"DIMENSIONAMENTO!G26","v":{"v":8.106,"d":"8.11"}},"Potência Alcançada (kW)",{"$f":"IFERROR(VLOOKUP(DIMENSIONAMENTO!M11,Products[#All],MATCH(Products[[#Headers],[Max Power EPS '[W']]],Products[#Headers],0),FALSE)*DIMENSIONAMENTO!K11/1000,\"\")","v":{"v":11.4,"d":"11.40"}}]

{"sheet":"Dados","index":4,"n_rows":52,"n_cols":18,"rows_kept":52,"hidden":true,"merged":[[34,1,34,3],[35,1,35,3],[37,1,37,3],[38,1,38,3],[39,1,39,3],[40,1,40,3]]}
[]
[null,"Tensão Nominal",null,"Fox ESS name","Max Power EPS [W]","Rated Voltage [V]","Max EPS current [A]","Peak Current (60s)  [A]","Peak Power (60s)  [W]","Picture","Datasheet","Manual",null,"Qtd","EP5","Capacity EP5","EP11","Capacity ep11"]
[null,380,null,"H1-5.0-E-G2",5000,220,22.7,null,null,{"$error":"#VALUE!"},"https://br.fox-ess.com/download/upfiles/BR-H1-G2-wl-Datasheet-V1.0-20250828.pdf","https://br.fox-ess.com/download/upfiles/PT-H1-G2-WL-Manual-V1.0.0-20250814.pdf",null,null,5.18,null,10.36]
[null,220,null,"KH7.5",7500,220,31.8,45.45,10000,{"$error":"#VALUE!"},"https://br.fox-ess.com/download/upfiles/BR-KH-KA-Datasheet-V1.3-20250828.pdf","https://br.fox-ess.com/download/upfiles/BR-KH-Manual-V1.0.0-20250401.pdf",null,1,{"$f":"O$3*N4*0.9","v":{"v":4.662,"d":"4.66"}},{"$f":"Table4[[#This Row],[EP5]]*DIMENSIONAMENTO!$K$11","v":{"v":4.662,"d":"4.66"}},{"$f":"$Q$3*N4*0.9","v":{"v":9.324,"d":"9.32"}},{"$f":"Table4[[#This Row],[EP11]]*DIMENSIONAMENTO!$K$11","v":{"v":9.324,"d":"9.32"}}]
[null,127,null,"KH10.5",10500,220,47.7,68.18,15000,{"$error":"#VALUE!"},"https://br.fox-ess.com/download/upfiles/BR-KH-KA-Datasheet-V1.3-20250828.pdf","https://br.fox-ess.com/download/upfiles/BR-KH-Manual-V1.0.0-20250401.pdf",null,2,{"$f":"$O$3*N5*0.9","v":{"v":9.324,"d":"9.32"}},{"$f":"Table4[[#This Row],[EP5]]*DIMENSIONAMENTO!$K$11","v":{"v":9.324,"d":"9.32"}},{"$f":"$Q$3*N5*0.9","v":{"v":18.648,"d":"18.65"}},{"$f":"Table4[[#This Row],[EP11]]*DIMENSIONAMENTO!$K$11","v":{"v":18.648,"d":"18.65"}}]
[{"$nulls":3},"H1-5.7-US",5700,"127/220",28.5,34.95,{"$f":"Products[[#This Row],[Peak Current (60s)  '[A']]]*220","v":7689.000000000001},{"$error":"#VALUE!"},"https://br.fox-ess.com/download/upfiles/BR-US-Datasheet-V1.0-20250517.pdf","https://br.fox-ess.com/download/upfiles/PT-US-User%20Manual-v1.2b-20250515.pdf",null,3,{"$f":"$O$3*N6*0.9","v":{"v":13.985999999999999,"d":"13.99"}},{"$f":"Table4[[#This Row],[EP5]]*DIMENSIONAMENTO!$K$11","v":{"v":13.985999999999999,"d":"13.99"}},{"$f":"$Q$3*N6*0.9","v":{"v":27.971999999999998,"d":"27.97"}},{"$f":"Table4[[#This Row],[EP11]]*DIMENSIONAMENTO!$K$11","v":{"v":27.971999999999998,"d":"27.97"}}]
[null,"Rede",null,"H1-7.5-US",7500,"127/220",37.5,46,{"$f":"Products[[#This Row],[Peak Current (60s)  '[A']]]*220","v":10120},{"$error":"#VALUE!"},"https://br.fox-ess.com/download/upfiles/BR-US-Datasheet-V1.0-20250517.pdf","https://br.fox-ess.com/download/upfiles/PT-US-User%20Manual-v1.2b-20250515.pdf",null,4,{"$f":"$O$3*N7*0.9","v":{"v":18.648,"d":"18.65"}},{"$f":"Table4[[#This Row],[EP5]]*DIMENSIONAMENTO!$K$11","v":{"v":18.648,"d":"18.65"}},{"$f":"$Q$3*N7*0.9","v":{"v":37.296,"d":"37.30"}},{"$f":"Table4[[#This Row],[EP11]]*DIMENSIONAMENTO!$K$11","v":{"v":37.296,"d":"37.30"}}]
[null,"Monofásica (220 V)",null,"H1-11.4-US",11400,"127/220",57,69.95,{"$f":"Products[[#This Row],[Peak Current (60s)  '[A']]]*220","v":15389},{"$error":"#VALUE!"},"https://br.fox-ess.com/download/upfiles/BR-US-Datasheet-V1.0-20250517.pdf","https://br.fox-ess.com/download/upfiles/PT-US-User%20Manual-v1.2b-20250515.pdf",{"$nulls":3},{"$f":"ROUNDUP(RESULTADO!$C$19/Dados!P4,0)","v":1},null,{"$f":"ROUNDUP(RESULTADO!$C$19/Dados!R4,0)","v":1}]
[null,"Bifásica (127/220 V)",null,"H3-PRO-11.5",11500,220,90.9,null,null,{"$error":"#VALUE!"},"https://br.fox-ess.com/download/upfiles/BR-H3-Pro-Datasheet-Low-Voltage-V1.7-20250828.pdf","https://br.fox-ess.com/download/upfiles/BR-H3-Pro-Manual-V1.0.0.pdf",{"$nulls":3},{"$f":"ROUNDUP(RESULTADO!$C$19/Dados!P5,0)","v":1},null,{"$f":"ROUNDUP(RESULTADO!$C$19/Dados!R5,0)","v":1}]
[null,"Trifásica (220/380 V)",null,"H3-12.0-E",12000,380,22.7,null,null,{"$error":"#VALUE!"},"https://br.fox-ess.com/download/upfiles/BR-H3-Datasheet-V2.7-20250331.pdf",{"$nulls":4},{"$f":"ROUNDUP(RESULTADO!$C$19/Dados!P6,0)","v":1},null,{"$f":"ROUNDUP(RESULTADO!$C$19/Dados!R6,0)","v":1}]
[null,"Trifásica (127/220 V)",null,"H3-PRO-20.0",20000,380,90.9,null,null,{"$error":"#VALUE!"},"https://br.fox-ess.com/download/upfiles/BR-H3-Pro-Datasheet-Low-Voltage-V1.7-20250828.pdf","https://br.fox-ess.com/download/upfiles/BR-H3-Pro-Manual-V1.0.0.pdf",{"$nulls":3},{"$f":"ROUNDUP(RESULTADO!$C$19/Dados!P7,0)","v":1},null,{"$f":"ROUNDUP(RESULTADO!$C$19/Dados!R7,0)","v":1}]
[]
[]
[null,"Other Values",null,"Fox ESS name","Especificação  Tecnologia","Tensão Nominal","Capacidade Nominal \nem 25 °C","Peso","Coluna1","Picture",{"$nulls":3},"DoD Màximo"]
[null,1000,null,"EP5","LFP",192,27,"50.5±2",null,{"$error":"#VALUE!"},{"$nulls":3},{"v":0.5,"d":"50%"}]
[{"$nulls":3},"EP11","LFP",384,27,"99±2",null,{"$error":"#VALUE!"},{"$nulls":3},{"v":0.6,"d":"60%"}]
[null,1,null,"HV Junction-Box","-","-","-","-","-",{"$error":"#VALUE!"},{"$nulls":3},{"v":0.7,"d":"70%"}]
[null,2,null,"AI Link (A-1000)","-","-","-","-","-",{"$error":"#VALUE!"},{"$nulls":3},{"v":0.8,"d":"80%"}]
[null,3,null,"Quadro Baixa Tensão",{"$nulls":5},{"$error":"#VALUE!"},{"$nulls":3},{"v":0.9,"d":"90%"}]
[null,4,null,"Fox Hub G2",{"$nulls":5},{"$error":"#VALUE!"}]
[]
[null,"Tempo de Autonomia"]
[null,1]
[null,2]
[null,3,{"$nulls":4},{"$f":"DIMENSIONAMENTO!C7","v":"Bifásica (127/220 V)"},{"$f":"DIMENSIONAMENTO!G26*1000","v":{"v":8106,"d":"8106.00"}}]
[null,4]
[null,5,{"$nulls":4},"Opções de Inversor"]
[null,6,{"$nulls":4},"Monofásica","Bifásica","Tri220","Tri380"]
[null,7,{"$nulls":3},1,{"$f":"E3","v":5000},{"$f":"E6","v":5700}]
[null,8,{"$nulls":3},2]
[null,12,{"$nulls":3},3]
[null,24,{"$nulls":3},4]
[{"$nulls":5},1,{"$f":"E4","v":7500},{"$f":"E7","v":7500},null,{"$f":"E10","v":12000}]
[{"$nulls":5},2,{"$f":"G$33*$F34","v":15000},{"$f":"H$33*$F34","v":15000},null,{"$f":"J$33*$F34","v":24000}]
[null,"AVISOS:",{"$nulls":3},3]
[null,"NÃO INDICADO",{"$nulls":3},4]
[null,"NÃO INDICADO PARA BACKUP/OFF-GRID",{"$nulls":3},5]
[null,"PARALELISMO APENAS POSSÍVEL COM O FOX HUB (VERIFIQUE COMPATIBILIDADE)",{"$nulls":3},1,{"$f":"E5","v":10500},{"$f":"E8","v":11400},{"$f":"E9","v":11500},{"$f":"E11","v":20000}]
[null,"PARALELISMO APENAS POSSÍVEL COM A AI LINK",{"$nulls":3},2,{"$f":"G$38*$F39","v":21000},{"$f":"H$38*$F39","v":22800},{"$f":"I$38*$F39","v":23000},{"$f":"J$38*$F39","v":40000}]
[null,"PARALELISMO APENAS POSSÍVEL COM A EM BOX",{"$nulls":3},3,{"$f":"$G$38*F40","v":31500},{"$f":"H$38*$F40","v":34200},34500,60000]
{"$rows_left_out":13}
{"sheet":"Exemplo 2","index":5,"n_rows":21,"n_cols":37,"rows_kept":21,"hidden":true,"merged":[[1,6,1,30]]}
[null,"Potência do equipamento (W) x Número de horas utilizadas por dia (h) x número de dias de uso por mês / 1000 = consumo em kWh/mês. "]
[{"$nulls":6},"SOLAR"]
[null,"Equipamento","Tensão (V)","Potencia\n (W)","Quantidade","Uso Diario\nRede ( horas)",0,1,2,3,4,5,6,7,8,9,10,11,12,13,14,15,16,17,18,19,20,21,22,23,"Uso Diario\nRede ( horas)","Consumo \nDia  (Wh)","Consumo \nDia  (kWh)","Consumo \nmês\n (Wh)","Consumo\n mês\n (KWh)"]
[null,"Notebook",220,60,1,{"v":4,"d":"4.00"},{"$nulls":7},"x","x","x","x","x","x","x","x","x","x","x",{"$nulls":6},{"$f":"+F4/3","v":{"v":1.3333333333333333,"d":"1.33"}},{"$f":"+AE4*D4","v":{"v":80,"d":"80.0"}},{"$f":"+AF4/1000","v":0.08},{"$f":"+AE4*D4*30","v":{"v":2400,"d":"2,400"}},{"$f":"+AH4/1000","v":2.4}]
[null,"Modem / Wifi / Internet",220,20,1,{"v":24,"d":"24.00"},{"$nulls":7},"x","x","x","x","x","x","x","x","x","x","x",{"$nulls":6},{"$f":"+F5/3","v":{"v":8,"d":"8.00"}},160,{"$f":"+AF5/1000","v":0.16},{"$f":"+AE5*D5*30","v":{"v":4800,"d":"4,800"}},{"$f":"+AH5/1000","v":4.8}]
[null,"Impressora",220,50,1,{"$f":"10/60","v":{"v":0.16666666666666666,"d":"0.17"}},{"$nulls":7},"x","x","x","x","x","x","x","x","x","x","x",{"$nulls":6},{"v":0.05555555555555555,"d":"0.06"},{"v":2.7777777777777777,"d":"2.8"},{"v":0.002777777777777778,"d":"0.00"},{"v":83.33333333333333,"d":"83"},0.08333333333333333]
[null,"Luzes",220,15,6,{"v":6,"d":"6.00"},{"$nulls":7},"x","x","x","x","x","x","x","x","x","x","x",{"$nulls":6},{"v":2,"d":"2.00"},{"v":30,"d":"30.0"},0.03,900,0.9]
[null,"TV",220,68,1,{"v":4,"d":"4.00"},{"$nulls":7},"x","x","x","x","x","x","x","x","x","x","x",{"$nulls":6},{"v":1.3333333333333333,"d":"1.33"},{"v":90.66666666666666,"d":"90.7"},{"v":0.09066666666666666,"d":"0.09"},{"v":2719.9999999999995,"d":"2,720"},2.7199999999999998]
[null,"MicroOndas",220,800,1,{"$f":"10/60","v":{"v":0.16666666666666666,"d":"0.17"}},{"$nulls":7},"x","x","x","x","x","x","x","x","x","x","x",{"$nulls":6},{"v":0.05555555555555555,"d":"0.06"},{"v":44.44444444444444,"d":"44.4"},{"v":0.044444444444444446,"d":"0.04"},{"v":1333.3333333333333,"d":"1,333"},1.3333333333333333]
[null,"Air Fryer",220,1500,1,{"$f":"10/60","v":{"v":0.16666666666666666,"d":"0.17"}},{"$nulls":7},"x","x","x","x","x","x","x","x","x","x","x",{"$nulls":6},{"v":0.05555555555555555,"d":"0.06"},{"v":83.33333333333333,"d":"83.3"},{"v":0.08333333333333333,"d":"0.08"},{"v":2500,"d":"2,500"},2.5]
[null,"Refrigerador",220,250,1,{"v":24,"d":"24.00"},{"$nulls":7},"x","x","x","x","x","x","x","x","x","x","x",{"$nulls":6},{"v":8,"d":"8.00"},{"v":2000,"d":"2000.0"},{"v":2,"d":"2.00"},{"v":60000,"d":"60,000"},60]
[null,"Freezer",220,150,1,{"v":24,"d":"24.00"},{"$nulls":7},"x","x","x","x","x","x","x","x","x","x","x",{"$nulls":6},{"v":8,"d":"8.00"},{"v":1200,"d":"1200.0"},{"v":1.2,"d":"1.20"},{"v":36000,"d":"36,000"},36]
[null,"Maquina Lavar",220,1500,1,{"v":2,"d":"2.00"},{"$nulls":7},"x","x","x","x","x","x","x","x","x","x","x",{"$nulls":6},{"v":0.6666666666666666,"d":"0.67"},{"v":1000,"d":"1000.0"},{"v":1,"d":"1.00"},{"v":30000,"d":"30,000"},30]
[null,"Chuveiro",220,4500,1,{"$f":"+F10*2","v":{"v":0.3333333333333333,"d":"0.33"}},{"$nulls":7},"x","x","x","x","x","x","x","x","x","x","x",{"$nulls":6},{"v":0.1111111111111111,"d":"0.11"},{"v":500,"d":"500.0"},{"v":0.5,"d":"0.50"},{"v":15000,"d":"15,000"},15]
[null,"Ar Condicionado 9000 BTU",220,850,1,{"v":4,"d":"4.00"},{"$nulls":7},"x","x","x","x","x","x","x","x","x","x","x",{"$nulls":6},{"v":1.3333333333333333,"d":"1.33"},{"v":1133.3333333333333,"d":"1133.3"},{"v":1.1333333333333333,"d":"1.13"},{"v":34000,"d":"34,000"},34]
[null,"Aspirador De po",220,1000,1,{"v":0.3333333333333333,"d":"0.33"},{"$nulls":7},"x","x","x","x","x","x","x","x","x","x","x",{"$nulls":6},{"v":0.1111111111111111,"d":"0.11"},{"v":111.1111111111111,"d":"111.1"},{"v":0.1111111111111111,"d":"0.11"},{"v":3333.333333333333,"d":"3,333"},3.333333333333333]
[null,"Secador De cabelo",220,1400,1,{"$f":"+F16","v":{"v":0.3333333333333333,"d":"0.33"}},{"$nulls":7},"x","x","x","x","x","x","x","x","x","x","x",{"$nulls":6},{"v":0.1111111111111111,"d":"0.11"},{"v":155.55555555555554,"d":"155.6"},{"v":0.15555555555555553,"d":"0.16"},{"v":4666.666666666666,"d":"4,667"},4.666666666666666]
[]
[{"$nulls":32},{"$f":"SUM(AG4:AG17)","v":{"v":6.591222222222222,"d":"6.59"}},null,{"$f":"SUM(AI4:AI17)","v":197.73666666666668},null,"02 baterias 5KW"]
[{"$nulls":32},"Total Diario\n (Kwh)",null," ",null,"01 Baterias 10 KW"]
[{"$nulls":34}," "]